Errors after install

Setting up the SI part of the WRF.

Errors after install

Postby katunmar30 » Tue Oct 26, 2021 8:01 am

Hello All,

I'm trying to install WRF V4.0

While compiling below errors are encountered. The programm can not use modules from file "frame".
I am compiling with option 34 - i.e gcc/gfortran , dmpar

Please help me.

f951: Fatal Error: Reading module ‘wrf_esmf_timemod’ at line 1647 column 49: Unexpected EOF
compilation terminated.
make[3]: [Makefile:61: ESMF_Alarm.o] Ошибка 1 (игнорирование)
f951: Fatal Error: Reading module ‘wrf_esmf_timemod’ at line 1647 column 49: Unexpected EOF
compilation terminated.
make[3]: [Makefile:61: ESMF_Clock.o] Ошибка 1 (игнорирование)
ESMF_AlarmClock.f:63:10:

63 | use WRF_ESMF_AlarmMod, only : ESMF_Alarm, ESMF_AlarmSet
| 1
Fatal Error: Cannot open module file ‘wrf_esmf_alarmmod.mod’ for reading at (1): Нет такого файла или каталога
compilation terminated.
make[3]: [Makefile:61: ESMF_AlarmClock.o] Ошибка 1 (игнорирование)
f951: Fatal Error: Reading module ‘wrf_esmf_timemod’ at line 1647 column 49: Unexpected EOF
compilation terminated.
make[3]: [Makefile:58: Meat.o] Ошибка 1 (игнорирование)
ESMF_Mod.f:4:7:

4 | USE WRF_ESMF_AlarmMod
| 1
Fatal Error: Cannot open module file ‘wrf_esmf_alarmmod.mod’ for reading at (1): Нет такого файла или каталога
compilation terminated.
make[3]: [Makefile:61: ESMF_Mod.o] Ошибка 1 (игнорирование)
module_symbols_util.f:17:12:

17 | USE ESMF_Mod, WRFU_ALARM => ESMF_ALARM
| 1
Fatal Error: Cannot open module file ‘esmf_mod.mod’ for reading at (1): Нет такого файла или каталога
compilation terminated.
make[3]: [Makefile:61: module_symbols_util.o] Ошибка 1 (игнорирование)
module_utility.f:4:12:

4 | USE module_symbols_util
| 1
Fatal Error: Cannot open module file ‘module_symbols_util.mod’ for reading at (1): Нет такого файла или каталога
compilation terminated.
make[3]: [Makefile:61: module_utility.o] Ошибка 1 (игнорирование)
ar: модификатор «u» игнорируется, так как по умолчанию используется «D» (смотрите «U»)
ar: создаётся libesmf_time.a
ar: ESMF_Alarm.o: Нет такого файла или каталога
make[3]: [Makefile:32: libesmf_time.a] Ошибка 1 (игнорирование)
ranlib: «libesmf_time.a»: Нет такого файла
make[3]: [Makefile:33: libesmf_time.a] Ошибка 1 (игнорирование)
ar: модификатор «u» игнорируется, так как по умолчанию используется «D» (смотрите «U»)
ar: модификатор «u» игнорируется, так как по умолчанию используется «D» (смотрите «U»)
ar: модификатор «u» игнорируется, так как по умолчанию используется «D» (смотрите «U»)
ar: модификатор «u» игнорируется, так как по умолчанию используется «D» (смотрите «U»)
ar: модификатор «u» игнорируется, так как по умолчанию используется «D» (смотрите «U»)
make[2]: *** Нет правила для сборки цели «/home/gidmet/WRF_DIR/WRF/external/esmf_time_f90/module_utility.o», требуемой для «module_wrf_error.o». Останов.
0.10user 0.01system 0:00.11elapsed 100%CPU (0avgtext+0avgdata 36324maxresident)k
0inputs+344outputs (0major+6477minor)pagefaults 0swaps
make[2]: *** Нет правила для сборки цели «/home/gidmet/WRF_DIR/WRF/external/esmf_time_f90/module_utility.o», требуемой для «module_bc_time_utilities.o». Останов.
make[1]: [Makefile:1062: shared] Ошибка 2 (игнорирование)
f951: Fatal Error: Reading module ‘module_state_description’ at line 3094 column 12: Unexpected EOF
compilation terminated.
Command exited with non-zero status 1
0.01user 0.01system 0:00.02elapsed 100%CPU (0avgtext+0avgdata 19112maxresident)k
0inputs+8outputs (0major+1726minor)pagefaults 0swaps
make[3]: [../configure.wrf:354: module_cam_support.o] Ошибка 1 (игнорирование)
f951: Fatal Error: Reading module ‘module_state_description’ at line 3094 column 12: Unexpected EOF
compilation terminated.
Command exited with non-zero status 1
0.00user 0.01system 0:00.01elapsed 94%CPU (0avgtext+0avgdata 19940maxresident)k
0inputs+8outputs (0major+1969minor)pagefaults 0swaps
make[3]: [../configure.wrf:355: module_bl_mynn.o] Ошибка 1 (игнорирование)
../frame/module_comm_dm.f90:4:7:

4 | USE module_comm_dm_0
| 1
Fatal Error: Cannot open module file ‘module_comm_dm_0.mod’ for reading at (1): Нет такого файла или каталога
compilation terminated.
Command exited with non-zero status 1
0.01user 0.00system 0:00.01elapsed 94%CPU (0avgtext+0avgdata 19276maxresident)k
0inputs+8outputs (0major+1609minor)pagefaults 0swaps
make[3]: [../configure.wrf:357: ../frame/module_comm_dm.o] Ошибка 1 (игнорирование)
module_mp_thompson.f90:49:10:

49 | USE module_dm, ONLY : wrf_dm_max_real
| 1
Fatal Error: Cannot open module file ‘module_dm.mod’ for reading at (1): Нет такого файла или каталога
compilation terminated.
Command exited with non-zero status 1
0.01user 0.01system 0:00.02elapsed 96%CPU (0avgtext+0avgdata 20260maxresident)k
0inputs+8outputs (0major+1897minor)pagefaults 0swaps
make[3]: [../configure.wrf:353: module_mp_thompson.o] Ошибка 1 (игнорирование)
../frame/module_dm.f90:22:7:

22 | USE module_cpl, ONLY : coupler_on, cpl_init
| 1
Fatal Error: Cannot open module file ‘module_cpl.mod’ for reading at (1): Нет такого файла или каталога
compilation terminated.
Command exited with non-zero status 1
0.05user 0.02system 0:00.07elapsed 97%CPU (0avgtext+0avgdata 39304maxresident)k
0inputs+8outputs (0major+6904minor)pagefaults 0swaps
make[3]: [../configure.wrf:357: ../frame/module_dm.o] Ошибка 1 (игнорирование)
../frame/module_domain.f90:30:7:

30 | USE module_configure
| 1
Fatal Error: Cannot open module file ‘module_configure.mod’ for reading at (1): Нет такого файла или каталога
compilation terminated.
Command exited with non-zero status 1
0.01user 0.00system 0:00.02elapsed 95%CPU (0avgtext+0avgdata 22664maxresident)k
0inputs+8outputs (0major+2631minor)pagefaults 0swaps
make[3]: [../configure.wrf:353: ../frame/module_domain.o] Ошибка 1 (игнорирование)
f951: Fatal Error: Reading module ‘module_state_description’ at line 3094 column 12: Unexpected EOF
compilation terminated.
Command exited with non-zero status 1
0.13user 0.02system 0:00.16elapsed 99%CPU (0avgtext+0avgdata 37048maxresident)k
0inputs+272outputs (0major+6864minor)pagefaults 0swaps
make[3]: [../configure.wrf:353: module_ra_rrtmg_lw.o] Ошибка 1 (игнорирование)
../share/module_bc.f90:7:7:

7 | USE module_configure
| 1
Fatal Error: Cannot open module file ‘module_configure.mod’ for reading at (1): Нет такого файла или каталога
compilation terminated.
Command exited with non-zero status 1
0.01user 0.00system 0:00.02elapsed 95%CPU (0avgtext+0avgdata 19820maxresident)k
0inputs+8outputs (0major+1806minor)pagefaults 0swaps
make[3]: [../configure.wrf:357: ../share/module_bc.o] Ошибка 1 (игнорирование)
../share/module_soil_pre.f90:4:7:

4 | USE module_date_time
| 1
Fatal Error: Cannot open module file ‘module_date_time.mod’ for reading at (1): Нет такого файла или каталога
compilation terminated.
Command exited with non-zero status 1
0.01user 0.00system 0:00.02elapsed 100%CPU (0avgtext+0avgdata 19912maxresident)k
0inputs+8outputs (0major+1813minor)pagefaults 0swaps
make[3]: [../configure.wrf:354: ../share/module_soil_pre.o] Ошибка 1 (игнорирование)
../phys/module_mp_thompson.f90:49:10:

49 | USE module_dm, ONLY : wrf_dm_max_real
| 1
Fatal Error: Cannot open module file ‘module_dm.mod’ for reading at (1): Нет такого файла или каталога
compilation terminated.
Command exited with non-zero status 1
0.01user 0.01system 0:00.02elapsed 95%CPU (0avgtext+0avgdata 20204maxresident)k
0inputs+8outputs (0major+1895minor)pagefaults 0swaps
make[3]: [../configure.wrf:352: ../phys/module_mp_thompson.o] Ошибка 1 (игнорирование)
f951: Fatal Error: Reading module ‘module_state_description’ at line 3094 column 12: Unexpected EOF
compilation terminated.
Command exited with non-zero status 1
0.03user 0.01system 0:00.05elapsed 98%CPU (0avgtext+0avgdata 32820maxresident)k
0inputs+8outputs (0major+5237minor)pagefaults 0swaps
make[3]: [../configure.wrf:353: ../frame/module_configure.o] Ошибка 1 (игнорирование)
module_sf_myjsfc.f90:8:10:

8 | USE MODULE_DM, ONLY : WRF_DM_MAXVAL
| 1
Fatal Error: Cannot open module file ‘module_dm.mod’ for reading at (1): Нет такого файла или каталога
compilation terminated.
Command exited with non-zero status 1
0.00user 0.01system 0:00.01elapsed 94%CPU (0avgtext+0avgdata 19488maxresident)k
0inputs+8outputs (0major+1677minor)pagefaults 0swaps
make[3]: [../configure.wrf:354: module_sf_myjsfc.o] Ошибка 1 (игнорирование)
f951: Fatal Error: Reading module ‘module_sf_urban’ at line 1973 column 8: Unexpected EOF
compilation terminated.
Command exited with non-zero status 1
0.02user 0.00system 0:00.02elapsed 100%CPU (0avgtext+0avgdata 19804maxresident)k
0inputs+8outputs (0major+1799minor)pagefaults 0swaps
make[3]: [../configure.wrf:356: module_sf_bep.o] Ошибка 1 (игнорирование)
f951: Fatal Error: Reading module ‘module_sf_urban’ at line 1973 column 8: Unexpected EOF
compilation terminated.
Command exited with non-zero status 1
0.01user 0.01system 0:00.02elapsed 96%CPU (0avgtext+0avgdata 20084maxresident)k
0inputs+8outputs (0major+1879minor)pagefaults 0swaps
make[3]: [../configure.wrf:356: module_sf_bep_bem.o] Ошибка 1 (игнорирование)
../share/module_date_time.f90:6:6:

6 | USE module_configure
| 1
Fatal Error: Cannot open module file ‘module_configure.mod’ for reading at (1): Нет такого файла или каталога
compilation terminated.
Command exited with non-zero status 1
0.01user 0.01system 0:00.02elapsed 95%CPU (0avgtext+0avgdata 19284maxresident)k
0inputs+8outputs (0major+1652minor)pagefaults 0swaps
make[3]: [../configure.wrf:353: ../share/module_date_time.o] Ошибка 1 (игнорирование)
module_mp_fast_sbm.f90:5394:8:

5394 | USE module_domain
| 1
Fatal Error: Cannot open module file ‘module_domain.mod’ for reading at (1): Нет такого файла или каталога
compilation terminated.
Command exited with non-zero status 1
0.08user 0.00system 0:00.09elapsed 98%CPU (0avgtext+0avgdata 28716maxresident)k
0inputs+40outputs (0major+4087minor)pagefaults 0swaps
make[3]: [../configure.wrf:353: module_mp_fast_sbm.o] Ошибка 1 (игнорирование)
0.00user 0.02system 0:00.03elapsed 100%CPU (0avgtext+0avgdata 19156maxresident)k
0inputs+24outputs (0major+3081minor)pagefaults 0swaps
f951: Fatal Error: Reading module ‘module_sf_noahlsm’ at line 1557 column 19: Unexpected EOF
compilation terminated.
Command exited with non-zero status 1
0.00user 0.00system 0:00.01elapsed 94%CPU (0avgtext+0avgdata 19380maxresident)k
0inputs+8outputs (0major+1704minor)pagefaults 0swaps
make[3]: [../configure.wrf:354: module_sf_noah_seaice.o] Ошибка 1 (игнорирование)
f951: Fatal Error: Reading module ‘module_state_description’ at line 3094 column 12: Unexpected EOF
compilation terminated.
Command exited with non-zero status 1
0.00user 0.01system 0:00.01elapsed 100%CPU (0avgtext+0avgdata 19092maxresident)k
0inputs+8outputs (0major+1722minor)pagefaults 0swaps
make[3]: [../configure.wrf:357: module_sf_ocean_driver.o] Ошибка 1 (игнорирование)
module_sf_qnsesfc.f90:8:10:

8 | USE MODULE_DM, ONLY : WRF_DM_MAXVAL
| 1
Fatal Error: Cannot open module file ‘module_dm.mod’ for reading at (1): Нет такого файла или каталога
compilation terminated.
Command exited with non-zero status 1
0.00user 0.01system 0:00.02elapsed 95%CPU (0avgtext+0avgdata 19440maxresident)k
0inputs+8outputs (0major+1682minor)pagefaults 0swaps
make[3]: [../configure.wrf:356: module_sf_qnsesfc.o] Ошибка 1 (игнорирование)
module_sf_fogdes.f90:5:6:

5 | USE module_bl_mynn, only: qcgmin, gno, gpw
| 1
Fatal Error: Cannot open module file ‘module_bl_mynn.mod’ for reading at (1): Нет такого файла или каталога
compilation terminated.
Command exited with non-zero status 1
0.01user 0.00system 0:00.02elapsed 95%CPU (0avgtext+0avgdata 19384maxresident)k
0inputs+8outputs (0major+1639minor)pagefaults 0swaps
make[3]: [../configure.wrf:354: module_sf_fogdes.o] Ошибка 1 (игнорирование)
f951: Fatal Error: Reading module ‘module_state_description’ at line 3094 column 12: Unexpected EOF
compilation terminated.
Command exited with non-zero status 1
0.01user 0.01system 0:00.02elapsed 92%CPU (0avgtext+0avgdata 19808maxresident)k
0inputs+8outputs (0major+1887minor)pagefaults 0swaps
make[3]: [../configure.wrf:357: module_physics_addtendc.o] Ошибка 1 (игнорирование)
module_fdda_spnudging.f90:11:6:

11 | USE module_dm , ONLY : ntasks_x, ntasks_y, local_communicator_x, local_communicator_y, data_order_xzy
| 1
Fatal Error: Cannot open module file ‘module_dm.mod’ for reading at (1): Нет такого файла или каталога
compilation terminated.
Command exited with non-zero status 1
0.01user 0.00system 0:00.02elapsed 95%CPU (0avgtext+0avgdata 19600maxresident)k
0inputs+8outputs (0major+1690minor)pagefaults 0swaps
make[3]: [../configure.wrf:354: module_fdda_spnudging.o] Ошибка 1 (игнорирование)
module_fddaobs_rtfdda.f90:77:6:

77 | USE module_domain
| 1
Fatal Error: Cannot open module file ‘module_domain.mod’ for reading at (1): Нет такого файла или каталога
compilation terminated.
Command exited with non-zero status 1
0.01user 0.00system 0:00.02elapsed 96%CPU (0avgtext+0avgdata 19844maxresident)k
0inputs+8outputs (0major+1769minor)pagefaults 0swaps
make[3]: [../configure.wrf:356: module_fddaobs_rtfdda.o] Ошибка 1 (игнорирование)
module_wind_fitch.f90:49:6:

49 | USE module_dm, ONLY : wrf_dm_min_real
| 1
Fatal Error: Cannot open module file ‘module_dm.mod’ for reading at (1): Нет такого файла или каталога
compilation terminated.
Command exited with non-zero status 1
0.01user 0.01system 0:00.02elapsed 100%CPU (0avgtext+0avgdata 19700maxresident)k
0inputs+8outputs (0major+1717minor)pagefaults 0swaps
make[3]: [../configure.wrf:353: module_wind_fitch.o] Ошибка 1 (игнорирование)
f951: Fatal Error: Reading module ‘module_state_description’ at line 3094 column 12: Unexpected EOF
compilation terminated.
Command exited with non-zero status 1
0.01user 0.00system 0:00.02elapsed 100%CPU (0avgtext+0avgdata 19212maxresident)k
0inputs+8outputs (0major+1736minor)pagefaults 0swaps
make[3]: [../configure.wrf:354: module_microphysics_zero_out.o] Ошибка 1 (игнорирование)
../frame/module_cpl.f90:3:7:

3 | USE module_domain , ONLY : domain, get_ijk_from_grid
| 1
Fatal Error: Cannot open module file ‘module_domain.mod’ for reading at (1): Нет такого файла или каталога
compilation terminated.
Command exited with non-zero status 1
0.02user 0.00system 0:00.02elapsed 100%CPU (0avgtext+0avgdata 20032maxresident)k
0inputs+8outputs (0major+1819minor)pagefaults 0swaps
make[3]: [../configure.wrf:357: ../frame/module_cpl.o] Ошибка 1 (игнорирование)
f951: Fatal Error: Reading module ‘module_state_description’ at line 3094 column 12: Unexpected EOF
compilation terminated.
Command exited with non-zero status 1
0.01user 0.01system 0:00.02elapsed 95%CPU (0avgtext+0avgdata 19340maxresident)k
0inputs+8outputs (0major+1750minor)pagefaults 0swaps
make[3]: [../configure.wrf:352: module_ltng_crmpr92.o] Ошибка 1 (игнорирование)
f951: Fatal Error: Reading module ‘module_state_description’ at line 3094 column 12: Unexpected EOF
compilation terminated.
Command exited with non-zero status 1
0.01user 0.01system 0:00.02elapsed 96%CPU (0avgtext+0avgdata 19268maxresident)k
0inputs+8outputs (0major+1733minor)pagefaults 0swaps
make[3]: [../configure.wrf:354: module_ltng_cpmpr92z.o] Ошибка 1 (игнорирование)
module_ltng_iccg.f90:274:5:

274 | USE module_utility
| 1
Fatal Error: Cannot open module file ‘module_utility.mod’ for reading at (1): Нет такого файла или каталога
compilation terminated.
module_fddagd_driver.f90:37:7:

37 | USE module_configure
| 1
Fatal Error: Cannot open module file ‘module_configure.mod’ for reading at (1): Нет такого файла или каталога
compilation terminated.
Command exited with non-zero status 1
0.01user 0.00system 0:00.02elapsed 96%CPU (0avgtext+0avgdata 19472maxresident)k
0inputs+8outputs (0major+1675minor)pagefaults 0swaps
make[3]: [../configure.wrf:357: module_ltng_iccg.o] Ошибка 1 (игнорирование)
Command exited with non-zero status 1
0.01user 0.00system 0:00.02elapsed 100%CPU (0avgtext+0avgdata 19456maxresident)k
0inputs+8outputs (0major+1654minor)pagefaults 0swaps
make[3]: [../configure.wrf:352: module_fddagd_driver.o] Ошибка 1 (игнорирование)
module_fddaobs_driver.f90:66:6:

66 | USE module_domain
| 1
Fatal Error: Cannot open module file ‘module_domain.mod’ for reading at (1): Нет такого файла или каталога
compilation terminated.
Command exited with non-zero status 1
0.00user 0.01system 0:00.02elapsed 100%CPU (0avgtext+0avgdata 19468maxresident)k
0inputs+8outputs (0major+1661minor)pagefaults 0swaps
make[3]: [../configure.wrf:354: module_fddaobs_driver.o] Ошибка 1 (игнорирование)
make[3]: *** Нет правила для сборки цели «../external/esmf_time_f90/module_utility.o», требуемой для «module_diag_afwa.o». Останов.
make[3]: *** Ожидание завершения заданий…
module_diag_misc.f90:34:6:

34 | USE module_dm, ONLY: wrf_dm_sum_real, wrf_dm_maxval
| 1
Fatal Error: Cannot open module file ‘module_dm.mod’ for reading at (1): Нет такого файла или каталога
compilation terminated.
Command exited with non-zero status 1
0.01user 0.00system 0:00.02elapsed 100%CPU (0avgtext+0avgdata 19448maxresident)k
0inputs+8outputs (0major+1640minor)pagefaults 0swaps
make[3]: [../configure.wrf:356: module_diag_misc.o] Ошибка 1 (игнорирование)
f951: Fatal Error: Reading module ‘module_state_description’ at line 3094 column 12: Unexpected EOF
compilation terminated.
Command exited with non-zero status 1
0.01user 0.01system 0:00.02elapsed 100%CPU (0avgtext+0avgdata 19420maxresident)k
0inputs+8outputs (0major+1756minor)pagefaults 0swaps
make[3]: [../configure.wrf:357: module_diag_nwp.o] Ошибка 1 (игнорирование)
module_diag_cl.f90:32:6:

32 | USE module_dm, ONLY: wrf_dm_sum_real, wrf_dm_maxval
| 1
Fatal Error: Cannot open module file ‘module_dm.mod’ for reading at (1): Нет такого файла или каталога
compilation terminated.
Command exited with non-zero status 1
0.01user 0.00system 0:00.01elapsed 94%CPU (0avgtext+0avgdata 19248maxresident)k
0inputs+8outputs (0major+1641minor)pagefaults 0swaps
make[3]: [../configure.wrf:351: module_diag_cl.o] Ошибка 1 (игнорирование)
0.51user 0.01system 0:00.52elapsed 100%CPU (0avgtext+0avgdata 48040maxresident)k
0inputs+432outputs (0major+9319minor)pagefaults 0swaps
ar: модификатор «u» игнорируется, так как по умолчанию используется «D» (смотрите «U»)
ar: создаётся ../main/libwrflib.a
ar: module_cam_support.o: Нет такого файла или каталога
make[2]: [Makefile:238: physics] Ошибка 1 (игнорирование)
module_ieva_em.f90:3:6:

3 | USE module_bc
| 1
Fatal Error: Cannot open module file ‘module_bc.mod’ for reading at (1): Нет такого файла или каталога
compilation terminated.
Command exited with non-zero status 1
0.01user 0.01system 0:00.02elapsed 100%CPU (0avgtext+0avgdata 19360maxresident)k
0inputs+8outputs (0major+1666minor)pagefaults 0swaps
make[2]: [../configure.wrf:357: module_ieva_em.o] Ошибка 1 (игнорирование)
../share/module_bc.f90:7:7:

7 | USE module_configure
| 1
Fatal Error: Cannot open module file ‘module_configure.mod’ for reading at (1): Нет такого файла или каталога
compilation terminated.
Command exited with non-zero status 1
0.01user 0.01system 0:00.02elapsed 96%CPU (0avgtext+0avgdata 19896maxresident)k
0inputs+8outputs (0major+1810minor)pagefaults 0swaps
make[2]: [../configure.wrf:355: ../share/module_bc.o] Ошибка 1 (игнорирование)
../frame/module_domain.f90:30:7:

30 | USE module_configure
| 1
Fatal Error: Cannot open module file ‘module_configure.mod’ for reading at (1): Нет такого файла или каталога
compilation terminated.
Command exited with non-zero status 1
0.02user 0.01system 0:00.03elapsed 97%module_wps_io_arw.f90:3:7:

3 | USE module_optional_input
| 1
Fatal Error: Cannot open module file ‘module_optional_input.mod’ for reading at (1): Нет такого файла или каталога
CPU compilation terminated.
(0avgtext+0avgdata 22620maxresident)k
0inputs+8outputs (0major+2634minor)pagefaults 0swaps
make[2]: [../configure.wrf:356: ../frame/module_domain.o] Ошибка 1 (игнорирование)
Command exited with non-zero status 1
0.01user 0.01system 0:00.02elapsed 100%CPU (0avgtext+0avgdata 20348maxresident)k
0inputs+8outputs (0major+1885minor)pagefaults 0swaps
make[2]: [../configure.wrf:471: module_wps_io_arw.o] Ошибка 1 (игнорирование)
f951: Fatal Error: Reading module ‘module_state_description’ at line 3094 column 12: Unexpected EOF
compilation terminated.
Command exited with non-zero status 1
0.00user 0.01system 0:00.01elapsed 100%CPU (0avgtext+0avgdata 19612maxresident)k
0inputs+8outputs (0major+1825minor)pagefaults 0swaps
make[2]: [../configure.wrf:353: module_polarfft.o] Ошибка 1 (игнорирование)
f951: Fatal Error: Reading module ‘module_state_description’ at line 3094 column 12: Unexpected EOF
compilation terminated.
Command exited with non-zero status 1
0.02user 0.02system 0:00.04elapsed 100%CPU (0avgtext+0avgdata 32780maxresident)k
0inputs+8outputs (0major+5237minor)pagefaults 0swaps
make[2]: [../configure.wrf:356: ../frame/module_configure.o] Ошибка 1 (игнорирование)
f951: Fatal Error: Reading module ‘module_state_description’ at line 3094 column 12: Unexpected EOF
compilation terminated.
Command exited with non-zero status 1
0.02user 0.00system 0:00.02elapsed 96%CPU (0avgtext+0avgdata 19688maxresident)k
0inputs+8outputs (0major+1873minor)pagefaults 0swaps
make[2]: [../configure.wrf:356: ../phys/module_cumulus_driver.o] Ошибка 1 (игнорирование)
f951: Fatal Error: Reading module ‘module_state_description’ at line 3094 column 12: Unexpected EOF
compilation terminated.
Command exited with non-zero status 1
0.02user 0.00system 0:00.03elapsed 97%CPU (0avgtext+0avgdata 20240maxresident)k
0inputs+8outputs (0major+2041minor)pagefaults 0swaps
make[2]: [../configure.wrf:357: ../phys/module_radiation_driver.o] Ошибка 1 (игнорирование)
f951: Fatal Error: Reading module ‘module_state_description’ at line 3094 column 12: Unexpected EOF
compilation terminated.
Command exited with non-zero status 1
0.02user 0.00system 0:00.03elapsed 94%CPU (0avgtext+0avgdata 21260maxresident)k
0inputs+8outputs (0major+2315minor)pagefaults 0swaps
make[2]: [../configure.wrf:353: ../phys/module_surface_driver.o] Ошибка 1 (игнорирование)
f951: Fatal Error: Reading module ‘module_state_description’ at line 3094 column 12: Unexpected EOF
compilation terminated.
Command exited with non-zero status 1
0.01user 0.00system 0:00.02elapsed 95%CPU (0avgtext+0avgdata 19540maxresident)k
0inputs+8outputs (0major+1796minor)pagefaults 0swaps
make[2]: [../configure.wrf:354: ../phys/module_shallowcu_driver.o] Ошибка 1 (игнорирование)
../phys/module_fr_fire_driver_wrf.f90:8:4:

8 | use module_fr_fire_driver
| 1
Fatal Error: Cannot open module file ‘module_fr_fire_driver.mod’ for reading at (1): Нет такого файла или каталога
compilation terminated.
Command exited with non-zero status 1
0.01user 0.00system 0:00.02elapsed 95%CPU (0avgtext+0avgdata 19348maxresident)k
0inputs+8outputs (0major+1619minor)pagefaults 0swaps
make[2]: [../configure.wrf:356: ../phys/module_fr_fire_driver_wrf.o] Ошибка 1 (игнорирование)
../frame/module_comm_dm.f90:4:7:

4 | USE module_comm_dm_0
| 1
Fatal Error: Cannot open module file ‘module_comm_dm_0.mod’ for reading at (1): Нет такого файла или каталога
compilation terminated.
Command exited with non-zero status 1
0.00user 0.01system 0:00.02elapsed 95%CPU (0avgtext+0avgdata 19060maxresident)k
0inputs+8outputs (0major+1606minor)pagefaults 0swaps
make[2]: [../configure.wrf:357: ../frame/module_comm_dm.o] Ошибка 1 (игнорирование)
f951: Fatal Error: Reading module ‘module_state_description’ at line 3094 column 12: Unexpected EOF
compilation terminated.
Command exited with non-zero status 1
0.03user 0.00system 0:00.03elapsed 97%CPU (0avgtext+0avgdata 19924maxresident)k
0inputs+8outputs (0major+1927minor)pagefaults 0swaps
make[2]: [../configure.wrf:353: ../phys/module_pbl_driver.o] Ошибка 1 (игнорирование)
../phys/module_fddagd_driver.f90:37:7:

37 | USE module_configure
| 1
Fatal Error: Cannot open module file ‘module_configure.mod’ for reading at (1): Нет такого файла или каталога
compilation terminated.
Command exited with non-zero status 1
0.01user 0.00system 0:00.02elapsed 100%CPU (0avgtext+0avgdata 19452maxresident)k
0inputs+8outputs (0major+1656minor)pagefaults 0swaps
make[2]: [../configure.wrf:353: ../phys/module_fddagd_driver.o] Ошибка 1 (игнорирование)
module_stoch.f90:111:8:

111 | USE module_configure
| 1
Fatal Error: Cannot open module file ‘module_configure.mod’ for reading at (1): Нет такого файла или каталога
compilation terminated.
module_sfs_nba.f90:44:6:

44 | USE module_configure, ONLY : grid_config_rec_type
| 1
Fatal Error: Cannot open module file ‘module_configure.mod’ for reading at (1): Нет такого файла или каталога
compilation terminated.
Command exited with non-zero status 1
0.01user 0.00system 0:00.02elapsed 96%CPU (0avgtext+0avgdata 19668maxresident)k
0inputs+8outputs (0major+1708minor)pagefaults 0swaps
make[2]: [../configure.wrf:357: module_stoch.o] Ошибка 1 (игнорирование)
Command exited with non-zero status 1
0.01user 0.01system 0:00.02elapsed 95%CPU (0avgtext+0avgdata 19288maxresident)k
0inputs+8outputs (0major+1653minor)pagefaults 0swaps
make[2]: [../configure.wrf:352: module_sfs_nba.o] Ошибка 1 (игнорирование)
../frame/module_tiles.f90:6:6:

6 | USE module_configure
| 1
Fatal Error: Cannot open module file ‘module_configure.mod’ for reading at (1): Нет такого файла или каталога
compilation terminated.
Command exited with non-zero status 1
0.01user 0.00system 0:00.02elapsed 95%CPU (0avgtext+0avgdata 19404maxresident)k
0inputs+8outputs (0major+1650minor)pagefaults 0swaps
make[2]: [../configure.wrf:353: ../frame/module_tiles.o] Ошибка 1 (игнорирование)
module_avgflx_em.f90:5:6:

5 | USE module_bc
| 1
Fatal Error: Cannot open module file ‘module_bc.mod’ for reading at (1): Нет такого файла или каталога
compilation terminated.
Command exited with non-zero status 1
0.01user 0.00system 0:00.02elapsed 90%CPU (0avgtext+0avgdata 19224maxresident)k
0inputs+8outputs (0major+1623minor)pagefaults 0swaps
../phys/module_fddaobs_driver.f90:66:6:

66 | USE module_domain
| 1
Fatal Error: Cannot open module file ‘module_domain.mod’ for reading at (1): Нет такого файла или каталога
make[2]: [../configure.wrf:355: module_avgflx_em.o] Ошибка 1 (игнорирование)
compilation terminated.
Command exited with non-zero status 1
0.00user 0.01system 0:00.02elapsed 95%CPU (0avgtext+0avgdata 19504maxresident)k
0inputs+8outputs (0major+1656minor)pagefaults 0swaps
make[2]: [../configure.wrf:352: ../phys/module_fddaobs_driver.o] Ошибка 1 (игнорирование)
f951: Fatal Error: Reading module ‘module_state_description’ at line 3094 column 12: Unexpected EOF
compilation terminated.
Command exited with non-zero status 1
0.01user 0.00system 0:00.02elapsed 95%CPU (0avgtext+0avgdata 19436maxresident)k
0inputs+8outputs (0major+1820minor)pagefaults 0swaps
make[2]: [../configure.wrf:354: ../phys/module_diagnostics_driver.o] Ошибка 1 (игнорирование)
../frame/module_cpl.f90:3:7:

3 | USE module_domain , ONLY : domain, get_ijk_from_grid
| 1
Fatal Error: Cannot open module file ‘module_domain.mod’ for reading at (1): Нет такого файла или каталога
compilation terminated.
Command exited with non-zero status 1
0.02user 0.00system 0:00.02elapsed 100%CPU (0avgtext+0avgdata 20092maxresident)k
0inputs+8outputs (0major+1815minor)pagefaults 0swaps
make[2]: [../configure.wrf:357: ../frame/module_cpl.o] Ошибка 1 (игнорирование)
f951: Fatal Error: Reading module ‘module_state_description’ at line 3094 column 12: Unexpected EOF
compilation terminated.
Command exited with non-zero status 1
0.01user 0.00system 0:00.01elapsed 93%CPU (0avgtext+0avgdata 19328maxresident)k
0inputs+8outputs (0major+1739minor)pagefaults 0swaps
make[2]: [../configure.wrf:353: ../phys/module_microphysics_zero_out.o] Ошибка 1 (игнорирование)
f951: Fatal Error: Reading module ‘module_state_description’ at line 3094 column 12: Unexpected EOF
compilation terminated.
Command exited with non-zero status 1
0.02user 0.00system 0:00.02elapsed 100%CPU (0avgtext+0avgdata 20148maxresident)k
0inputs+8outputs (0major+1971minor)pagefaults 0swaps
make[2]: [../configure.wrf:352: ../phys/module_microphysics_driver.o] Ошибка 1 (игнорирование)
../frame/module_dm.f90:22:7:

22 | USE module_cpl, ONLY : coupler_on, cpl_init
| 1
Fatal Error: Cannot open module file ‘module_cpl.mod’ for reading at (1): Нет такого файла или каталога
compilation terminated.
Command exited with non-zero status 1
0.06user 0.02system 0:00.08elapsed 100%CPU (0avgtext+0avgdata 39328maxresident)k
0inputs+8outputs (0major+6903minor)pagefaults 0swaps
make[2]: [../configure.wrf:354: ../frame/module_dm.o] Ошибка 1 (игнорирование)
../share/module_io_domain.f90:5:4:

5 | USE module_io
| 1
Fatal Error: Cannot open module file ‘module_io.mod’ for reading at (1): Нет такого файла или каталога
compilation terminated.
f951: Fatal Error: Reading module ‘module_state_description’ at line 3094 column 12: Unexpected EOF
compilation terminated.
Command exited with non-zero status 1
0.00user 0.01system 0:00.02elapsed 95%CPU (0avgtext+0avgdata 19560maxresident)k
0inputs+8outputs (0major+1697minor)pagefaults 0swaps
make[2]: [../configure.wrf:354: ../share/module_io_domain.o] Ошибка 1 (игнорирование)
../share/module_date_time.f90:6:6:

6 | USE module_configure
| 1
Fatal Error: Cannot open module file ‘module_configure.mod’ for reading at (1): Нет такого файла или каталога
compilation terminated.
Command exited with non-zero status 1
0.01user 0.01system 0:00.03elapsed 96%CPU (0avgtext+0avgdata 19900maxresident)k
0inputs+8outputs (0major+1888minor)pagefaults 0swaps
make[2]: [../configure.wrf:352: ../phys/module_physics_addtendc.o] Ошибка 1 (игнорирование)
Command exited with non-zero status 1
0.00user 0.01system 0:00.02elapsed 91%CPU (0avgtext+0avgdata 19396maxresident)k
0inputs+8outputs (0major+1651minor)pagefaults 0swaps
make[2]: [../configure.wrf:352: ../share/module_date_time.o] Ошибка 1 (игнорирование)
f951: Fatal Error: Reading module ‘module_state_description’ at line 3094 column 12: Unexpected EOF
compilation terminated.
Command exited with non-zero status 1
0.00user 0.01system 0:00.02elapsed 96%CPU (0avgtext+0avgdata 20428maxresident)k
0inputs+8outputs (0major+2070minor)pagefaults 0swaps
make[2]: [../configure.wrf:357: ../phys/module_physics_init.o] Ошибка 1 (игнорирование)
couple_or_uncouple_em.f90:25:7:

25 | USE module_domain, ONLY : domain, get_ijk_from_grid
| 1
Fatal Error: Cannot open module file ‘module_domain.mod’ for reading at (1): Нет такого файла или каталога
compilation terminated.
f951: Fatal Error: Reading module ‘module_state_description’ at line 3094 column 12: Unexpected EOF
compilation terminated.
Command exited with non-zero status 1
0.01user 0.00system 0:00.02elapsed 95%CPU (0avgtext+0avgdata 19432maxresident)k
0inputs+8outputs (0major+1655minor)pagefaults 0swaps
make[2]: [../configure.wrf:354: couple_or_uncouple_em.o] Ошибка 1 (игнорирование)
Command exited with non-zero status 1
0.01user 0.01system 0:00.02elapsed 100%CPU (0avgtext+0avgdata 19460maxresident)k
0inputs+8outputs (0major+1769minor)pagefaults 0swaps
make[2]: [../configure.wrf:351: shift_domain_em.o] Ошибка 1 (игнорирование)
nest_init_utils.f90:5:7:

5 | USE module_domain, ONLY : domain
| 1
Fatal Error: Cannot open module file ‘module_domain.mod’ for reading at (1): Нет такого файла или каталога
compilation terminated.
Command exited with non-zero status 1
0.00user 0.01system 0:00.02elapsed 95%CPU (0avgtext+0avgdata 19464maxresident)k
0inputs+8outputs (0major+1675minor)pagefaults 0swaps
make[2]: [../configure.wrf:352: nest_init_utils.o] Ошибка 1 (игнорирование)
0.01user 0.01system 0:00.03elapsed 97%CPU (0avgtext+0avgdata 24304maxresident)k
0inputs+16outputs (0major+3361minor)pagefaults 0swaps
module_small_step_em.f90:11:7:

11 | USE module_configure
| 1
Fatal Error: Cannot open module file ‘module_configure.mod’ for reading at (1): Нет такого файла или каталога
compilation terminated.
Command exited with non-zero status 1
0.01user 0.00system 0:00.02elapsed 95%CPU (0avgtext+0avgdata 19644maxresident)k
0inputs+8outputs (0major+1688minor)pagefaults 0swaps
make[2]: [../configure.wrf:357: module_small_step_em.o] Ошибка 1 (игнорирование)
f951: Fatal Error: Reading module ‘module_state_description’ at line 3094 column 12: Unexpected EOF
compilation terminated.
Command exited with non-zero status 1
0.01user 0.00system 0:00.02elapsed 96%CPU (0avgtext+0avgdata 20340maxresident)k
0inputs+8outputs (0major+2043minor)pagefaults 0swaps
make[2]: [../configure.wrf:356: module_big_step_utilities_em.o] Ошибка 1 (игнорирование)
module_advect_em.f90:7:6:

7 | USE module_bc
| 1
Fatal Error: Cannot open module file ‘module_bc.mod’ for reading at (1): Нет такого файла или каталога
compilation terminated.
Command exited with non-zero status 1
0.01user 0.01system 0:00.03elapsed 96%CPU (0avgtext+0avgdata 21312maxresident)k
0inputs+8outputs (0major+2198minor)pagefaults 0swaps
make[2]: [../configure.wrf:355: module_advect_em.o] Ошибка 1 (игнорирование)
module_bc_em.f90:6:7:

6 | USE module_bc, ONLY: set_physical_bc2d, set_physical_bc3d, spec_bdytend, &
| 1
Fatal Error: Cannot open module file ‘module_bc.mod’ for reading at (1): Нет такого файла или каталога
compilation terminated.
Command exited with non-zero status 1
0.02user 0.00system 0:00.02elapsed 100%CPU (0avgtext+0avgdata 19640maxresident)k
0inputs+8outputs (0major+1742minor)pagefaults 0swaps
make[2]: [../configure.wrf:357: module_bc_em.o] Ошибка 1 (игнорирование)
module_sfs_driver.f90:61:6:

61 | USE module_domain
| 1
Fatal Error: Cannot open module file ‘module_domain.mod’ for reading at (1): Нет такого файла или каталога
compilation terminated.
Command exited with non-zero status 1
0.01user 0.00system 0:00.02elapsed 100%CPU (0avgtext+0avgdata 19304maxresident)k
0inputs+8outputs (0major+1640minor)pagefaults 0swaps
make[2]: [../configure.wrf:357: module_sfs_driver.o] Ошибка 1 (игнорирование)
f951: Fatal Error: Reading module ‘module_state_description’ at line 3094 column 12: Unexpected EOF
compilation terminated.
Command exited with non-zero status 1
0.00user 0.01system 0:00.02elapsed 96%CPU (0avgtext+0avgdata 19168maxresident)k
0inputs+8outputs (0major+1721minor)pagefaults 0swaps
make[2]: [../configure.wrf:354: module_after_all_rk_steps.o] Ошибка 1 (игнорирование)
0.03user 0.00system 0:00.04elapsed 95%CPU (0avgtext+0avgdata 22696maxresident)k
0inputs+16outputs (0major+3273minor)pagefaults 0swaps
module_diffusion_em.f90:6:8:

6 | USE module_bc, only: set_physical_bc3d, set_physical_bc2d
| 1
Fatal Error: Cannot open module file ‘module_bc.mod’ for reading at (1): Нет такого файла или каталога
compilation terminated.
Command exited with non-zero status 1
0.01user 0.00system 0:00.01elapsed 100%CPU (0avgtext+0avgdata 20816maxresident)k
0inputs+8outputs (0major+2041minor)pagefaults 0swaps
make[2]: [../configure.wrf:356: module_diffusion_em.o] Ошибка 1 (игнорирование)
module_em.f90:9:7:

9 | USE module_advect_em, only: advect_u, advect_v, advect_w, advect_scalar, advect_scalar_pd, advect_scalar_mono, &
| 1
Fatal Error: Cannot open module file ‘module_advect_em.mod’ for reading at (1): Нет такого файла или каталога
compilation terminated.
Command exited with non-zero status 1
0.02user 0.00system 0:00.02elapsed 100%CPU (0avgtext+0avgdata 19892maxresident)k
0inputs+8outputs (0major+1809minor)pagefaults 0swaps
make[2]: [../configure.wrf:354: module_em.o] Ошибка 1 (игнорирование)
start_em.f90:21:7:

21 | USE module_domain, ONLY : domain, wrfu_timeinterval, get_ijk_from_grid, &
| 1
Fatal Error: Cannot open module file ‘module_domain.mod’ for reading at (1): Нет такого файла или каталога
compilation terminated.
Command exited with non-zero status 1
0.00user 0.00system 0:00.01elapsed 94%CPU (0avgtext+0avgdata 19864maxresident)k
0inputs+8outputs (0major+1791minor)pagefaults 0swaps
make[2]: [../configure.wrf:356: start_em.o] Ошибка 1 (игнорирование)
adapt_timestep_em.f90:18:6:

18 | USE module_domain
| 1
Fatal Error: Cannot open module file ‘module_domain.mod’ for reading at (1): Нет такого файла или каталога
compilation terminated.
Command exited with non-zero status 1
0.00user 0.01system 0:00.02elapsed 100%CPU (0avgtext+0avgdata 19292maxresident)k
0inputs+8outputs (0major+1630minor)pagefaults 0swaps
make[2]: [../configure.wrf:354: adapt_timestep_em.o] Ошибка 1 (игнорирование)
f951: Fatal Error: Reading module ‘module_state_description’ at line 3094 column 12: Unexpected EOF
compilation terminated.
Command exited with non-zero status 1
0.01user 0.01system 0:00.02elapsed 100%CPU (0avgtext+0avgdata 19584maxresident)k
0inputs+8outputs (0major+1825minor)pagefaults 0swaps
make[2]: [../configure.wrf:357: module_first_rk_step_part2.o] Ошибка 1 (игнорирование)
f951: Fatal Error: Reading module ‘module_state_description’ at line 3094 column 12: Unexpected EOF
compilation terminated.
Command exited with non-zero status 1
0.01user 0.01system 0:00.02elapsed 100%CPU (0avgtext+0avgdata 19500maxresident)k
0inputs+8outputs (0major+1832minor)pagefaults 0swaps
make[2]: [../configure.wrf:351: module_first_rk_step_part1.o] Ошибка 1 (игнорирование)
f951: Fatal Error: Reading module ‘module_state_description’ at line 3094 column 12: Unexpected EOF
compilation terminated.
Command exited with non-zero status 1
0.02user 0.01system 0:00.03elapsed 96%CPU (0avgtext+0avgdata 20480maxresident)k
0inputs+8outputs (0major+2052minor)pagefaults 0swaps
make[2]: [../configure.wrf:357: solve_em.o] Ошибка 1 (игнорирование)
ar: модификатор «u» игнорируется, так как по умолчанию используется «D» (смотрите «U»)
ar: создаётся ../main/libwrflib.a
ar: module_advect_em.o: Нет такого файла или каталога
make[2]: [Makefile:58: dyn_em] Ошибка 1 (игнорирование)
../main/module_wrf_top.f90:13:7:

13 | USE module_domain
| 1
Fatal Error: Cannot open module file ‘module_domain.mod’ for reading at (1): Нет такого файла или каталога
compilation terminated.
Command exited with non-zero status 1
0.01user 0.00system 0:00.02elapsed 95%CPU (0avgtext+0avgdata 19404maxresident)k
0inputs+8outputs (0major+1651minor)pagefaults 0swaps
make[1]: [../configure.wrf:357: ../main/module_wrf_top.o] Ошибка 1 (игнорирование)
wrf.f90:6:7:

6 | USE module_wrf_top, only : wrf_init, wrf_dfi, wrf_run, wrf_finalize
| 1
Fatal Error: Cannot open module file ‘module_wrf_top.mod’ for reading at (1): Нет такого файла или каталога
compilation terminated.
Command exited with non-zero status 1
0.00user 0.01system 0:00.02elapsed 95%CPU (0avgtext+0avgdata 19172maxresident)k
0inputs+8outputs (0major+1612minor)pagefaults 0swaps
make[1]: [../configure.wrf:357: wrf.o] Ошибка 1 (игнорирование)
ranlib: «libwrflib.a»: Нет такого файла
make[1]: [Makefile:16: em_wrf] Ошибка 1 (игнорирование)
gfortran: error: wrf.o: Нет такого файла или каталога
gfortran: error: ../main/module_wrf_top.o: Нет такого файла или каталога
gfortran: error: libwrflib.a: Нет такого файла или каталога
gfortran: error: /home/gidmet/WRF_DIR/WRF/frame/module_internal_header_util.o: Нет такого файла или каталога
gfortran: error: /home/gidmet/WRF_DIR/WRF/frame/pack_utils.o: Нет такого файла или каталога
Command exited with non-zero status 1
0.00user 0.00system 0:00.00elapsed 88%CPU (0avgtext+0avgdata 3632maxresident)k
0inputs+0outputs (0major+490minor)pagefaults 0swaps
make[1]: [Makefile:17: em_wrf] Ошибка 1 (игнорирование)
../dyn_em/module_initialize_real.f90:10:7:

10 | USE module_bc
| 1
Fatal Error: Cannot open module file ‘module_bc.mod’ for reading at (1): Нет такого файла или каталога
compilation terminated.
Command exited with non-zero status 1
0.01user 0.01system 0:00.03elapsed 97%CPU (0avgtext+0avgdata 20968maxresident)k
0inputs+8outputs (0major+2132minor)pagefaults 0swaps
make[1]: [../configure.wrf:357: ../dyn_em/module_initialize_real.o] Ошибка 1 (игнорирование)
../frame/module_domain.f90:30:7:

30 | USE module_configure
| 1
Fatal Error: Cannot open module file ‘module_configure.mod’ for reading at (1): Нет такого файла или каталога
compilation terminated.
Command exited with non-zero status 1
0.02user 0.01system 0:00.04elapsed 100%CPU (0avgtext+0avgdata 22784maxresident)k
0inputs+8outputs (0major+2640minor)pagefaults 0swaps
make[1]: [../configure.wrf:357: ../frame/module_domain.o] Ошибка 1 (игнорирование)
f951: Fatal Error: Reading module ‘module_state_description’ at line 3094 column 12: Unexpected EOF
compilation terminated.
Command exited with non-zero status 1
0.06user 0.01system 0:00.07elapsed 98%CPU (0avgtext+0avgdata 32920maxresident)k
0inputs+8outputs (0major+5242minor)pagefaults 0swaps
make[1]: [../configure.wrf:357: ../frame/module_configure.o] Ошибка 1 (игнорирование)
../frame/module_dm.f90:22:7:

22 | USE module_cpl, ONLY : coupler_on, cpl_init
| 1
Fatal Error: Cannot open module file ‘module_cpl.mod’ for reading at (1): Нет такого файла или каталога
compilation terminated.
Command exited with non-zero status 1
0.06user 0.01system 0:00.08elapsed 98%CPU (0avgtext+0avgdata 39400maxresident)k
0inputs+8outputs (0major+6919minor)pagefaults 0swaps
make[1]: [../configure.wrf:357: ../frame/module_dm.o] Ошибка 1 (игнорирование)
../frame/module_integrate.f90:12:7:

12 | USE module_domain
| 1
Fatal Error: Cannot open module file ‘module_domain.mod’ for reading at (1): Нет такого файла или каталога
compilation terminated.
Command exited with non-zero status 1
0.00user 0.01system 0:00.02elapsed 95%CPU (0avgtext+0avgdata 19288maxresident)k
0inputs+8outputs (0major+1631minor)pagefaults 0swaps
make[1]: [../configure.wrf:357: ../frame/module_integrate.o] Ошибка 1 (игнорирование)
../share/module_bc.f90:7:7:

7 | USE module_configure
| 1
Fatal Error: Cannot open module file ‘module_configure.mod’ for reading at (1): Нет такого файла или каталога
compilation terminated.
Command exited with non-zero status 1
0.01user 0.01system 0:00.02elapsed 96%CPU (0avgtext+0avgdata 19876maxresident)k
0inputs+8outputs (0major+1814minor)pagefaults 0swaps
make[1]: [../configure.wrf:357: ../share/module_bc.o] Ошибка 1 (игнорирование)
../share/module_io_domain.f90:5:4:

5 | USE module_io
| 1
Fatal Error: Cannot open module file ‘module_io.mod’ for reading at (1): Нет такого файла или каталога
compilation terminated.
Command exited with non-zero status 1
0.01user 0.00system 0:00.02elapsed 95%CPU (0avgtext+0avgdata 19600maxresident)k
0inputs+8outputs (0major+1690minor)pagefaults 0swaps
make[1]: [../configure.wrf:357: ../share/module_io_domain.o] Ошибка 1 (игнорирование)
../share/module_soil_pre.f90:4:7:

4 | USE module_date_time
| 1
Fatal Error: Cannot open module file ‘module_date_time.mod’ for reading at (1): Нет такого файла или каталога
compilation terminated.
Command exited with non-zero status 1
0.01user 0.00system 0:00.02elapsed 100%CPU (0avgtext+0avgdata 19960maxresident)k
0inputs+8outputs (0major+1815minor)pagefaults 0swaps
make[1]: [../configure.wrf:357: ../share/module_soil_pre.o] Ошибка 1 (игнорирование)
f951: Fatal Error: Reading module ‘module_state_description’ at line 3094 column 12: Unexpected EOF
compilation terminated.
Command exited with non-zero status 1
0.01user 0.01system 0:00.03elapsed 100%CPU (0avgtext+0avgdata 20164maxresident)k
0inputs+8outputs (0major+2043minor)pagefaults 0swaps
make[1]: [../configure.wrf:357: ../dyn_em/module_big_step_utilities_em.o] Ошибка 1 (игнорирование)
../dyn_em/nest_init_utils.f90:5:7:

5 | USE module_domain, ONLY : domain
| 1
Fatal Error: Cannot open module file ‘module_domain.mod’ for reading at (1): Нет такого файла или каталога
compilation terminated.
Command exited with non-zero status 1
0.01user 0.01system 0:00.02elapsed 95%CPU (0avgtext+0avgdata 19552maxresident)k
0inputs+8outputs (0major+1686minor)pagefaults 0swaps
make[1]: [../configure.wrf:357: ../dyn_em/nest_init_utils.o] Ошибка 1 (игнорирование)
make[1]: *** Нет правила для сборки цели «/home/gidmet/WRF_DIR/WRF/external/esmf_time_f90/module_utility.o», требуемой для «ndown_em.o». Останов.
make: *** [Makefile:539: em_real] Ошибка 2
katunmar30
 
Posts: 1
Joined: Tue Oct 26, 2021 7:52 am

Return to Installation

Who is online

Users browsing this forum: No registered users and 1 guest