[solved] Compilation Error

Discussions related to the use of ARWPost

[solved] Compilation Error

Postby rafaelca » Sun Nov 16, 2014 8:00 pm

Hi, I'm trying to compile ARWpost 3.1 but I'm not able to correctly get ARWpost.exe working. I'm getting this as output from the ./compile command:

Code: Select all
**** Compiling ARWpost ****
 
/bin/rm -f module_model_basics.o module_model_basics.mod
/bin/cp module_model_basics.f90 module_model_basics.f
gfortran -ffree-form -O -fno-second-underscore -fconvert=big-endian -frecord-marker=4  -I/home/rafael/WRF/library/netcdf.4.3.2/include -c module_model_basics.f
/bin/rm -f module_model_basics.f
/bin/rm -f constants_module.o constants_module.mod
/bin/cp constants_module.f90 constants_module.f
gfortran -ffree-form -O -fno-second-underscore -fconvert=big-endian -frecord-marker=4  -I/home/rafael/WRF/library/netcdf.4.3.2/include -c constants_module.f
/bin/rm -f constants_module.f
/bin/rm -f misc_definitions_module.o misc_definitions_module.mod
/bin/cp misc_definitions_module.f90 misc_definitions_module.f
gfortran -ffree-form -O -fno-second-underscore -fconvert=big-endian -frecord-marker=4  -I/home/rafael/WRF/library/netcdf.4.3.2/include -c misc_definitions_module.f
/bin/rm -f misc_definitions_module.f
/bin/rm -f module_debug.o module_debug.mod
/bin/cp module_debug.f90 module_debug.f
gfortran -ffree-form -O -fno-second-underscore -fconvert=big-endian -frecord-marker=4  -I/home/rafael/WRF/library/netcdf.4.3.2/include -c module_debug.f
/bin/rm -f module_debug.f
/bin/rm -f module_get_file_names.o module_get_file_names.mod
/lib/cpp -C -P -traditional -DIO_NETCDF -DIO_GRIB1 -DIO_BINARY -DRECL4  -Dbytesw  module_get_file_names.F90 > module_get_file_names.f
gfortran -ffree-form -O -fno-second-underscore -fconvert=big-endian -frecord-marker=4  -I/home/rafael/WRF/library/netcdf.4.3.2/include -c module_get_file_names.f
module_get_file_names.f:1.1:

/* Copyright (C) 1991-2014 Free Software Foundation, Inc.
 1
Error: Invalid character in name at (1)
module_get_file_names.f:2.3:

   This file is part of the GNU C Library.
   1
Error: Unclassifiable statement at (1)
module_get_file_names.f:4.3:

   The GNU C Library is free software; you can redistribute it and/or
   1


And this goes on and on...Until this

Code: Select all
Fatal Error: Error count reached limit of 25.
../configure.arwp:68: recipe for target 'module_get_file_names.o' failed
make: [module_get_file_names.o] Error 1 (ignored)
/bin/rm -f module_get_file_names.f
/bin/rm -f gridinfo_module.o gridinfo_module.mod
/bin/cp gridinfo_module.f90 gridinfo_module.f
gfortran -ffree-form -O -fno-second-underscore -fconvert=big-endian -frecord-marker=4  -I/home/rafael/WRF/library/netcdf.4.3.2/include -c gridinfo_module.f
gridinfo_module.f:12.7:

   USE module_get_file_names
       1
Fatal Error: Can't open module file 'module_get_file_names.mod' for reading at (1): File or directory not found


And other modules gets the same kind of error, like output_module.mod, gridinfo_module.mod, and stops like this:

Code: Select all
gfortran: error: gridinfo_module.o: File or directory not found
gfortran: error: ARWpost.o: File or directory not found
gfortran: error: input_module.o: File or directory not found
gfortran: error: output_module.o: File or directory not found
gfortran: error: process_domain_module.o: File or directory not found
gfortran: error: module_get_file_names.o: File or directory not found
gfortran: error: module_interp.o: File or directory not found
gfortran: error: module_basic_arrays.o: File or directory not found
gfortran: error: module_diagnostics.o: File or directory not found
gfortran: error: module_arrays.o: File or directory not found
Makefile:18: recipe for target 'ARWpost.exe' failed
make: [ARWpost.exe] Error 1 (ignored)


Any kind of suggestion on what went wrong here? I'm using gfortran 4.9.1, WRF v.3.6.1, netcdf 4.3.2 (its correctly linked through NETCDF=home/rafael/WRF/library/netcdf.4.3.2).

Thanks in advance
Rafael
Last edited by rafaelca on Tue Dec 16, 2014 10:12 am, edited 1 time in total.
rafaelca
 
Posts: 6
Joined: Sun Nov 16, 2014 7:01 pm

Re: Compilation Error

Postby rafaelca » Sat Nov 22, 2014 12:22 pm

Still can't get ARWpost.exe working. Any suggestions?

Here is the complete compile.log file:


Code: Select all
**** Compiling ARWpost ****
 
/bin/rm -f module_model_basics.o module_model_basics.mod
/bin/cp module_model_basics.f90 module_model_basics.f
gfortran -ffree-form -O -fno-second-underscore -fconvert=big-endian -frecord-marker=4  -I/usr/local/include -c module_model_basics.f
/bin/rm -f module_model_basics.f
/bin/rm -f constants_module.o constants_module.mod
/bin/cp constants_module.f90 constants_module.f
gfortran -ffree-form -O -fno-second-underscore -fconvert=big-endian -frecord-marker=4  -I/usr/local/include -c constants_module.f
/bin/rm -f constants_module.f
/bin/rm -f misc_definitions_module.o misc_definitions_module.mod
/bin/cp misc_definitions_module.f90 misc_definitions_module.f
gfortran -ffree-form -O -fno-second-underscore -fconvert=big-endian -frecord-marker=4  -I/usr/local/include -c misc_definitions_module.f
/bin/rm -f misc_definitions_module.f
/bin/rm -f module_debug.o module_debug.mod
/bin/cp module_debug.f90 module_debug.f
gfortran -ffree-form -O -fno-second-underscore -fconvert=big-endian -frecord-marker=4  -I/usr/local/include -c module_debug.f
/bin/rm -f module_debug.f
/bin/rm -f module_get_file_names.o module_get_file_names.mod
/lib/cpp -C -P -traditional -DIO_NETCDF -DIO_GRIB1 -DIO_BINARY -DRECL4  -Dbytesw  module_get_file_names.F90 > module_get_file_names.f
gfortran -ffree-form -O -fno-second-underscore -fconvert=big-endian -frecord-marker=4  -I/usr/local/include -c module_get_file_names.f
module_get_file_names.f:1.1:

/* Copyright (C) 1991-2014 Free Software Foundation, Inc.
 1
Error: Invalid character in name at (1)
module_get_file_names.f:2.3:

   This file is part of the GNU C Library.
   1
Error: Unclassifiable statement at (1)
module_get_file_names.f:4.3:

   The GNU C Library is free software; you can redistribute it and/or
   1
Error: Unclassifiable statement at (1)
module_get_file_names.f:4.39:

   The GNU C Library is free software; you can redistribute it and/or
                                       1
Error: Unclassifiable statement at (1)
module_get_file_names.f:5.3:

   modify it under the terms of the GNU Lesser General Public
   1
Error: Unclassifiable statement at (1)
module_get_file_names.f:6.3:

   License as published by the Free Software Foundation; either
   1
Error: Unclassifiable statement at (1)
module_get_file_names.f:6.57:

   License as published by the Free Software Foundation; either
                                                         1
Error: Unclassifiable statement at (1)
module_get_file_names.f:7.3:

   version 2.1 of the License, or (at your option) any later version.
   1
Error: Unclassifiable statement at (1)
module_get_file_names.f:9.3:

   The GNU C Library is distributed in the hope that it will be useful,
   1
Error: Unclassifiable statement at (1)
module_get_file_names.f:10.3:

   but WITHOUT ANY WARRANTY; without even the implied warranty of
   1
Error: Unclassifiable statement at (1)
module_get_file_names.f:10.29:

   but WITHOUT ANY WARRANTY; without even the implied warranty of
                             1
Error: Unclassifiable statement at (1)
module_get_file_names.f:11.3:

   MERCHANTABILITY or FITNESS FOR A PARTICULAR PURPOSE.  See the GNU
   1
Error: Unclassifiable statement at (1)
module_get_file_names.f:12.3:

   Lesser General Public License for more details.
   1
Error: Unclassifiable statement at (1)
module_get_file_names.f:14.3:

   You should have received a copy of the GNU Lesser General Public
   1
Error: Unclassifiable statement at (1)
module_get_file_names.f:15.3:

   License along with the GNU C Library; if not, see
   1
Error: Unclassifiable statement at (1)
module_get_file_names.f:15.41:

   License along with the GNU C Library; if not, see
                                         1
Error: Unclassifiable statement at (1)
module_get_file_names.f:16.4:

   <http://www.gnu.org/licenses/>.  */
    1
Error: Invalid character in name at (1)
module_get_file_names.f:19.1:

/* This header is separate from features.h so that the compiler can
 1
Error: Invalid character in name at (1)
module_get_file_names.f:20.3:

   include it implicitly at the start of every compilation.  It must
   1
Error: Unclassifiable statement at (1)
module_get_file_names.f:21.3:

   not itself include <features.h> or any other header that includes
   1
Error: Unclassifiable statement at (1)
module_get_file_names.f:22.4:

   <features.h> because the implicit include comes before any feature
    1
Error: Invalid character in name at (1)
module_get_file_names.f:23.3:

   test macros that may be defined in a source file before it first
   1
Error: Unclassifiable statement at (1)
module_get_file_names.f:24.3:

   explicitly includes a system header.  GCC knows the name of this
   1
Error: Unclassifiable statement at (1)
module_get_file_names.f:25.3:

   header in order to preinclude it.  */
   1
Error: Unclassifiable statement at (1)
module_get_file_names.f:27.1:

/* glibc's intent is to support the IEC 559 math functionality, real
 1
Error: Invalid character in name at (1)
Fatal Error: Error count reached limit of 25.
../configure.arwp:68: recipe for target 'module_get_file_names.o' failed
make: [module_get_file_names.o] Error 1 (ignored)
/bin/rm -f module_get_file_names.f
/bin/rm -f gridinfo_module.o gridinfo_module.mod
/bin/cp gridinfo_module.f90 gridinfo_module.f
gfortran -ffree-form -O -fno-second-underscore -fconvert=big-endian -frecord-marker=4  -I/usr/local/include -c gridinfo_module.f
gridinfo_module.f:12.7:

   USE module_get_file_names
       1
Fatal Error: Can't open module file 'module_get_file_names.mod' for reading at (1): Arquivo ou diretório não encontrado
../configure.arwp:62: recipe for target 'gridinfo_module.o' failed
make: [gridinfo_module.o] Error 1 (ignored)
/bin/rm -f gridinfo_module.f
/bin/rm -f module_date_pack.o module_date_pack.mod
/bin/cp module_date_pack.f90 module_date_pack.f
gfortran -ffree-form -O -fno-second-underscore -fconvert=big-endian -frecord-marker=4  -I/usr/local/include -c module_date_pack.f
/bin/rm -f module_date_pack.f
/bin/rm -f input_module.o input_module.mod
/bin/cp input_module.f90 input_module.f
gfortran -ffree-form -O -fno-second-underscore -fconvert=big-endian -frecord-marker=4  -I/usr/local/include -c input_module.f
input_module.f:3.7:

   USE gridinfo_module
       1
Fatal Error: Can't open module file 'gridinfo_module.mod' for reading at (1): Arquivo ou diretório não encontrado
../configure.arwp:62: recipe for target 'input_module.o' failed
make: [input_module.o] Error 1 (ignored)
/bin/rm -f input_module.f
/bin/rm -f module_arrays.o module_arrays.mod
/bin/cp module_arrays.f90 module_arrays.f
gfortran -ffree-form -O -fno-second-underscore -fconvert=big-endian -frecord-marker=4  -I/usr/local/include -c module_arrays.f
module_arrays.f:75.6:

  USE gridinfo_module
      1
Fatal Error: Can't open module file 'gridinfo_module.mod' for reading at (1): Arquivo ou diretório não encontrado
../configure.arwp:62: recipe for target 'module_arrays.o' failed
make: [module_arrays.o] Error 1 (ignored)
/bin/rm -f module_arrays.f
/bin/rm -f module_pressure.o module_pressure.mod
/bin/cp module_pressure.f90 module_pressure.f
gfortran -ffree-form -O -fno-second-underscore -fconvert=big-endian -frecord-marker=4  -I/usr/local/include -c module_pressure.f
/bin/rm -f module_pressure.f
/bin/rm -f module_interp.o module_interp.mod
/bin/cp module_interp.f90 module_interp.f
gfortran -ffree-form -O -fno-second-underscore -fconvert=big-endian -frecord-marker=4  -I/usr/local/include -c module_interp.f
module_interp.f:3.7:

   USE input_module
       1
Fatal Error: Can't open module file 'input_module.mod' for reading at (1): Arquivo ou diretório não encontrado
../configure.arwp:62: recipe for target 'module_interp.o' failed
make: [module_interp.o] Error 1 (ignored)
/bin/rm -f module_interp.f
/bin/rm -f output_module.o output_module.mod
/lib/cpp -C -P -traditional -DIO_NETCDF -DIO_GRIB1 -DIO_BINARY -DRECL4  -Dbytesw  output_module.F90 > output_module.f
gfortran -ffree-form -O -fno-second-underscore -fconvert=big-endian -frecord-marker=4  -I/usr/local/include -c output_module.f
output_module.f:1.1:

/* Copyright (C) 1991-2014 Free Software Foundation, Inc.
 1
Error: Invalid character in name at (1)
output_module.f:2.3:

   This file is part of the GNU C Library.
   1
Error: Unclassifiable statement at (1)
output_module.f:4.3:

   The GNU C Library is free software; you can redistribute it and/or
   1
Error: Unclassifiable statement at (1)
output_module.f:4.39:

   The GNU C Library is free software; you can redistribute it and/or
                                       1
Error: Unclassifiable statement at (1)
output_module.f:5.3:

   modify it under the terms of the GNU Lesser General Public
   1
Error: Unclassifiable statement at (1)
output_module.f:6.3:

   License as published by the Free Software Foundation; either
   1
Error: Unclassifiable statement at (1)
output_module.f:6.57:

   License as published by the Free Software Foundation; either
                                                         1
Error: Unclassifiable statement at (1)
output_module.f:7.3:

   version 2.1 of the License, or (at your option) any later version.
   1
Error: Unclassifiable statement at (1)
output_module.f:9.3:

   The GNU C Library is distributed in the hope that it will be useful,
   1
Error: Unclassifiable statement at (1)
output_module.f:10.3:

   but WITHOUT ANY WARRANTY; without even the implied warranty of
   1
Error: Unclassifiable statement at (1)
output_module.f:10.29:

   but WITHOUT ANY WARRANTY; without even the implied warranty of
                             1
Error: Unclassifiable statement at (1)
output_module.f:11.3:

   MERCHANTABILITY or FITNESS FOR A PARTICULAR PURPOSE.  See the GNU
   1
Error: Unclassifiable statement at (1)
output_module.f:12.3:

   Lesser General Public License for more details.
   1
Error: Unclassifiable statement at (1)
output_module.f:14.3:

   You should have received a copy of the GNU Lesser General Public
   1
Error: Unclassifiable statement at (1)
output_module.f:15.3:

   License along with the GNU C Library; if not, see
   1
Error: Unclassifiable statement at (1)
output_module.f:15.41:

   License along with the GNU C Library; if not, see
                                         1
Error: Unclassifiable statement at (1)
output_module.f:16.4:

   <http://www.gnu.org/licenses/>.  */
    1
Error: Invalid character in name at (1)
output_module.f:19.1:

/* This header is separate from features.h so that the compiler can
 1
Error: Invalid character in name at (1)
output_module.f:20.3:

   include it implicitly at the start of every compilation.  It must
   1
Error: Unclassifiable statement at (1)
output_module.f:21.3:

   not itself include <features.h> or any other header that includes
   1
Error: Unclassifiable statement at (1)
output_module.f:22.4:

   <features.h> because the implicit include comes before any feature
    1
Error: Invalid character in name at (1)
output_module.f:23.3:

   test macros that may be defined in a source file before it first
   1
Error: Unclassifiable statement at (1)
output_module.f:24.3:

   explicitly includes a system header.  GCC knows the name of this
   1
Error: Unclassifiable statement at (1)
output_module.f:25.3:

   header in order to preinclude it.  */
   1
Error: Unclassifiable statement at (1)
output_module.f:27.1:

/* glibc's intent is to support the IEC 559 math functionality, real
 1
Error: Invalid character in name at (1)
Fatal Error: Error count reached limit of 25.
../configure.arwp:68: recipe for target 'output_module.o' failed
make: [output_module.o] Error 1 (ignored)
/bin/rm -f output_module.f
/bin/rm -f module_basic_arrays.o module_basic_arrays.mod
/bin/cp module_basic_arrays.f90 module_basic_arrays.f
gfortran -ffree-form -O -fno-second-underscore -fconvert=big-endian -frecord-marker=4  -I/usr/local/include -c module_basic_arrays.f
module_basic_arrays.f:3.6:

  USE gridinfo_module
      1
Fatal Error: Can't open module file 'gridinfo_module.mod' for reading at (1): Arquivo ou diretório não encontrado
../configure.arwp:62: recipe for target 'module_basic_arrays.o' failed
make: [module_basic_arrays.o] Error 1 (ignored)
/bin/rm -f module_basic_arrays.f
/bin/rm -f module_calc_height.o module_calc_height.mod
/bin/cp module_calc_height.f90 module_calc_height.f
gfortran -ffree-form -O -fno-second-underscore -fconvert=big-endian -frecord-marker=4  -I/usr/local/include -c module_calc_height.f
/bin/rm -f module_calc_height.f
/bin/rm -f module_calc_pressure.o module_calc_pressure.mod
/bin/cp module_calc_pressure.f90 module_calc_pressure.f
gfortran -ffree-form -O -fno-second-underscore -fconvert=big-endian -frecord-marker=4  -I/usr/local/include -c module_calc_pressure.f
/bin/rm -f module_calc_pressure.f
/bin/rm -f module_calc_tk.o module_calc_tk.mod
/bin/cp module_calc_tk.f90 module_calc_tk.f
gfortran -ffree-form -O -fno-second-underscore -fconvert=big-endian -frecord-marker=4  -I/usr/local/include -c module_calc_tk.f
/bin/rm -f module_calc_tk.f
/bin/rm -f module_calc_tc.o module_calc_tc.mod
/bin/cp module_calc_tc.f90 module_calc_tc.f
gfortran -ffree-form -O -fno-second-underscore -fconvert=big-endian -frecord-marker=4  -I/usr/local/include -c module_calc_tc.f
/bin/rm -f module_calc_tc.f
/bin/rm -f module_calc_theta.o module_calc_theta.mod
/bin/cp module_calc_theta.f90 module_calc_theta.f
gfortran -ffree-form -O -fno-second-underscore -fconvert=big-endian -frecord-marker=4  -I/usr/local/include -c module_calc_theta.f
/bin/rm -f module_calc_theta.f
/bin/rm -f module_calc_td.o module_calc_td.mod
/bin/cp module_calc_td.f90 module_calc_td.f
gfortran -ffree-form -O -fno-second-underscore -fconvert=big-endian -frecord-marker=4  -I/usr/local/include -c module_calc_td.f
/bin/rm -f module_calc_td.f
/bin/rm -f module_calc_td2.o module_calc_td2.mod
/bin/cp module_calc_td2.f90 module_calc_td2.f
gfortran -ffree-form -O -fno-second-underscore -fconvert=big-endian -frecord-marker=4  -I/usr/local/include -c module_calc_td2.f
/bin/rm -f module_calc_td2.f
/bin/rm -f module_calc_rh.o module_calc_rh.mod
/bin/cp module_calc_rh.f90 module_calc_rh.f
gfortran -ffree-form -O -fno-second-underscore -fconvert=big-endian -frecord-marker=4  -I/usr/local/include -c module_calc_rh.f
/bin/rm -f module_calc_rh.f
/bin/rm -f module_calc_rh2.o module_calc_rh2.mod
/bin/cp module_calc_rh2.f90 module_calc_rh2.f
gfortran -ffree-form -O -fno-second-underscore -fconvert=big-endian -frecord-marker=4  -I/usr/local/include -c module_calc_rh2.f
/bin/rm -f module_calc_rh2.f
/bin/rm -f module_calc_uvmet.o module_calc_uvmet.mod
/bin/cp module_calc_uvmet.f90 module_calc_uvmet.f
gfortran -ffree-form -O -fno-second-underscore -fconvert=big-endian -frecord-marker=4  -I/usr/local/include -c module_calc_uvmet.f
/bin/rm -f module_calc_uvmet.f
/bin/rm -f module_calc_slp.o module_calc_slp.mod
/bin/cp module_calc_slp.f90 module_calc_slp.f
gfortran -ffree-form -O -fno-second-underscore -fconvert=big-endian -frecord-marker=4  -I/usr/local/include -c module_calc_slp.f
/bin/rm -f module_calc_slp.f
/bin/rm -f module_calc_dbz.o module_calc_dbz.mod
/bin/cp module_calc_dbz.f90 module_calc_dbz.f
gfortran -ffree-form -O -fno-second-underscore -fconvert=big-endian -frecord-marker=4  -I/usr/local/include -c module_calc_dbz.f
/bin/rm -f module_calc_dbz.f
/bin/rm -f module_calc_cape.o module_calc_cape.mod
/bin/cp module_calc_cape.f90 module_calc_cape.f
gfortran -ffree-form -O -fno-second-underscore -fconvert=big-endian -frecord-marker=4  -I/usr/local/include -c module_calc_cape.f
/bin/rm -f module_calc_cape.f
/bin/rm -f module_calc_wdir.o module_calc_wdir.mod
/bin/cp module_calc_wdir.f90 module_calc_wdir.f
gfortran -ffree-form -O -fno-second-underscore -fconvert=big-endian -frecord-marker=4  -I/usr/local/include -c module_calc_wdir.f
/bin/rm -f module_calc_wdir.f
/bin/rm -f module_calc_wspd.o module_calc_wspd.mod
/bin/cp module_calc_wspd.f90 module_calc_wspd.f
gfortran -ffree-form -O -fno-second-underscore -fconvert=big-endian -frecord-marker=4  -I/usr/local/include -c module_calc_wspd.f
/bin/rm -f module_calc_wspd.f
/bin/rm -f module_calc_clfr.o module_calc_clfr.mod
/bin/cp module_calc_clfr.f90 module_calc_clfr.f
gfortran -ffree-form -O -fno-second-underscore -fconvert=big-endian -frecord-marker=4  -I/usr/local/include -c module_calc_clfr.f
/bin/rm -f module_calc_clfr.f
/bin/rm -f module_diagnostics.o module_diagnostics.mod
/bin/cp module_diagnostics.f90 module_diagnostics.f
gfortran -ffree-form -O -fno-second-underscore -fconvert=big-endian -frecord-marker=4  -I/usr/local/include -c module_diagnostics.f
module_diagnostics.f:6.6:

  USE output_module
      1
Fatal Error: Can't open module file 'output_module.mod' for reading at (1): Arquivo ou diretório não encontrado
../configure.arwp:62: recipe for target 'module_diagnostics.o' failed
make: [module_diagnostics.o] Error 1 (ignored)
/bin/rm -f module_diagnostics.f
/bin/rm -f process_domain_module.o process_domain_module.mod
/lib/cpp -C -P -traditional -DIO_NETCDF -DIO_GRIB1 -DIO_BINARY -DRECL4  -Dbytesw  process_domain_module.F90 > process_domain_module.f
gfortran -ffree-form -O -fno-second-underscore -fconvert=big-endian -frecord-marker=4  -I/usr/local/include -c process_domain_module.f
process_domain_module.f:1.1:

/* Copyright (C) 1991-2014 Free Software Foundation, Inc.
 1
Error: Invalid character in name at (1)
process_domain_module.f:2.3:

   This file is part of the GNU C Library.
   1
Error: Unclassifiable statement at (1)
process_domain_module.f:4.3:

   The GNU C Library is free software; you can redistribute it and/or
   1
Error: Unclassifiable statement at (1)
process_domain_module.f:4.39:

   The GNU C Library is free software; you can redistribute it and/or
                                       1
Error: Unclassifiable statement at (1)
process_domain_module.f:5.3:

   modify it under the terms of the GNU Lesser General Public
   1
Error: Unclassifiable statement at (1)
process_domain_module.f:6.3:

   License as published by the Free Software Foundation; either
   1
Error: Unclassifiable statement at (1)
process_domain_module.f:6.57:

   License as published by the Free Software Foundation; either
                                                         1
Error: Unclassifiable statement at (1)
process_domain_module.f:7.3:

   version 2.1 of the License, or (at your option) any later version.
   1
Error: Unclassifiable statement at (1)
process_domain_module.f:9.3:

   The GNU C Library is distributed in the hope that it will be useful,
   1
Error: Unclassifiable statement at (1)
process_domain_module.f:10.3:

   but WITHOUT ANY WARRANTY; without even the implied warranty of
   1
Error: Unclassifiable statement at (1)
process_domain_module.f:10.29:

   but WITHOUT ANY WARRANTY; without even the implied warranty of
                             1
Error: Unclassifiable statement at (1)
process_domain_module.f:11.3:

   MERCHANTABILITY or FITNESS FOR A PARTICULAR PURPOSE.  See the GNU
   1
Error: Unclassifiable statement at (1)
process_domain_module.f:12.3:

   Lesser General Public License for more details.
   1
Error: Unclassifiable statement at (1)
process_domain_module.f:14.3:

   You should have received a copy of the GNU Lesser General Public
   1
Error: Unclassifiable statement at (1)
process_domain_module.f:15.3:

   License along with the GNU C Library; if not, see
   1
Error: Unclassifiable statement at (1)
process_domain_module.f:15.41:

   License along with the GNU C Library; if not, see
                                         1
Error: Unclassifiable statement at (1)
process_domain_module.f:16.4:

   <http://www.gnu.org/licenses/>.  */
    1
Error: Invalid character in name at (1)
process_domain_module.f:19.1:

/* This header is separate from features.h so that the compiler can
 1
Error: Invalid character in name at (1)
process_domain_module.f:20.3:

   include it implicitly at the start of every compilation.  It must
   1
Error: Unclassifiable statement at (1)
process_domain_module.f:21.3:

   not itself include <features.h> or any other header that includes
   1
Error: Unclassifiable statement at (1)
process_domain_module.f:22.4:

   <features.h> because the implicit include comes before any feature
    1
Error: Invalid character in name at (1)
process_domain_module.f:23.3:

   test macros that may be defined in a source file before it first
   1
Error: Unclassifiable statement at (1)
process_domain_module.f:24.3:

   explicitly includes a system header.  GCC knows the name of this
   1
Error: Unclassifiable statement at (1)
process_domain_module.f:25.3:

   header in order to preinclude it.  */
   1
Error: Unclassifiable statement at (1)
process_domain_module.f:27.1:

/* glibc's intent is to support the IEC 559 math functionality, real
 1
Error: Invalid character in name at (1)
Fatal Error: Error count reached limit of 25.
../configure.arwp:68: recipe for target 'process_domain_module.o' failed
make: [process_domain_module.o] Error 1 (ignored)
/bin/rm -f process_domain_module.f
/bin/rm -f ARWpost.o ARWpost.mod
/bin/cp ARWpost.f90 ARWpost.f
gfortran -ffree-form -O -fno-second-underscore -fconvert=big-endian -frecord-marker=4  -I/usr/local/include -c ARWpost.f
ARWpost.f:9.7:

   USE gridinfo_module
       1
Fatal Error: Can't open module file 'gridinfo_module.mod' for reading at (1): Arquivo ou diretório não encontrado
../configure.arwp:62: recipe for target 'ARWpost.o' failed
make: [ARWpost.o] Error 1 (ignored)
/bin/rm -f ARWpost.f
/bin/rm -f module_map_utils.o module_map_utils.mod
/bin/cp module_map_utils.f90 module_map_utils.f
gfortran -ffree-form -O -fno-second-underscore -fconvert=big-endian -frecord-marker=4  -I/usr/local/include -c module_map_utils.f
/bin/rm -f module_map_utils.f
gfortran -ffree-form -O -fno-second-underscore -fconvert=big-endian -frecord-marker=4   -o ARWpost.exe module_model_basics.o constants_module.o gridinfo_module.o ARWpost.o input_module.o output_module.o module_map_utils.o misc_definitions_module.o module_date_pack.o module_debug.o process_domain_module.o module_get_file_names.o module_interp.o module_basic_arrays.o module_diagnostics.o module_arrays.o module_pressure.o module_calc_height.o module_calc_pressure.o module_calc_theta.o module_calc_tk.o module_calc_tc.o module_calc_td.o module_calc_td2.o module_calc_rh.o module_calc_rh2.o module_calc_uvmet.o module_calc_slp.o module_calc_dbz.o module_calc_cape.o module_calc_wdir.o module_calc_wspd.o module_calc_clfr.o  \
   -L/usr/local/lib -I/usr/local/include  -lnetcdf
gfortran: error: gridinfo_module.o: Arquivo ou diretório não encontrado
gfortran: error: ARWpost.o: Arquivo ou diretório não encontrado
gfortran: error: input_module.o: Arquivo ou diretório não encontrado
gfortran: error: output_module.o: Arquivo ou diretório não encontrado
gfortran: error: process_domain_module.o: Arquivo ou diretório não encontrado
gfortran: error: module_get_file_names.o: Arquivo ou diretório não encontrado
gfortran: error: module_interp.o: Arquivo ou diretório não encontrado
gfortran: error: module_basic_arrays.o: Arquivo ou diretório não encontrado
gfortran: error: module_diagnostics.o: Arquivo ou diretório não encontrado
gfortran: error: module_arrays.o: Arquivo ou diretório não encontrado
Makefile:18: recipe for target 'ARWpost.exe' failed
make: [ARWpost.exe] Error 1 (ignored)


And the configure.arwp file:

Code: Select all
# configure.arwp
#
# This file was automatically generated by the configure script in the
# top level directory. You may make changes to the settings in this
# file but be aware they will be overwritten each time you run configure.
# Ordinarily, it is necessary to run configure once, when the code is
# first installed.
#
# To permanently change options, change the settings for your platform
# in the file arch/configure.defaults, the preamble, and the postamble -
# then rerun configure.
#

.SUFFIXES: .F90 .f90 .F .f .c .o

SHELL              =       /bin/sh

# Listing of options that are usually independent of machine type.
# When necessary, these are over-ridden by each architecture.

ARFLAGS         =   

PERL         =   perl

RANLIB         =   echo

#### Architecture specific settings ####

# Settings for PC Linux i486 i586 i686 x86_64, gfortran compiler
#
FC       =    gfortran
FFLAGS       =    -ffree-form -O -fno-second-underscore -fconvert=big-endian -frecord-marker=4
F77FLAGS    =    -ffixed-form -O -fno-second-underscore -fconvert=big-endian
FNGFLAGS    =    $(FFLAGS)
LDFLAGS    =
CC       =    gcc
CFLAGS       =     -m64
CPP       =    /lib/cpp -C -P -traditional
CPPFLAGS    =    -DIO_NETCDF -DIO_GRIB1 -DIO_BINARY -DRECL4  -Dbytesw

###########################################################
#
#   Macros, these should be generic for all machines

LN      =   ln -sf
MAKE      =   make -i -r
RM      =    /bin/rm -f
CP      =    /bin/cp
AR      =   ar ru


.IGNORE:
.SUFFIXES: .c .f90 .F90 .f .F .o

#   There is probably no reason to modify these rules

.c.o:
   $(RM) $@
   $(CC) $(CPPFLAGS) $(CFLAGS) -c $<   

.f90.o:
   $(RM) $@ $*.mod
   $(CP) $< $*.f
   $(FC) $(FFLAGS) -I${NETCDF}/include -c $*.f
   $(RM) $*.f

.F90.o:
   $(RM) $@ $*.mod
   $(CPP) $(CPPFLAGS) $(FDEFS) $< > $*.f
   $(FC) $(FFLAGS) -I${NETCDF}/include -c $*.f
   $(RM) $*.f


Thanks,
Rafael
rafaelca
 
Posts: 6
Joined: Sun Nov 16, 2014 7:01 pm

Re: [solved] Compilation Error

Postby rafaelca » Tue Dec 16, 2014 10:14 am

Managed to get ARWpost working. Just needed to follow this post:

viewtopic.php?f=5&t=6086

Thanks,
Rafael
rafaelca
 
Posts: 6
Joined: Sun Nov 16, 2014 7:01 pm

Re: [solved] Compilation Error

Postby john_col » Tue Feb 09, 2016 11:57 am

Sorry, I have this problem, and I read the post that you push in your post, but the problem persist, I want to knows that if you so have a copy of the configure.arwp fixed, you can send me this

sorry for my English
thanks
Johna
john_col
 
Posts: 4
Joined: Tue Feb 09, 2016 7:26 am

Re: [solved] Compilation Error

Postby regisgrundig » Mon May 23, 2016 4:28 pm

the topic http://forum.wrfforum.com/viewtopic.php?f=5&t=6086 helped me but in my case only this works:

configure.awrp
Code: Select all
CPP             =       /lib/cpp -P -traditional


/src/Makefile

Code: Select all
ARWpost.exe: $(OBJS)
        $(FC) $(FFLAGS) $(LDFLAGS) -o $@ $(OBJS)  \
                -L$(NETCDF)/lib -lnetcdf -lnetcdff -I$(NETCDF)/include  -lnetcdf



It´s works for me.

Regis
regisgrundig
 
Posts: 1
Joined: Mon May 23, 2016 4:12 pm

Re: [solved] Compilation Error

Postby Jipson Johnson » Thu Aug 11, 2016 7:36 am

I got this error while compiling ARW post processing, Because of this i didn't get the ARW.exe file
please help me as soon as possible

ranjith@ranjithoffice:~/Desktop/WRF/ARW_POST$ export NETCDF=/home/ranjith/Desktop/WRF/Build_WRF/LIBRARIES/netcdf-4.1.3
ranjith@ranjithoffice:~/Desktop/WRF/ARW_POST$ cd ARWpost/
ranjith@ranjithoffice:~/Desktop/WRF/ARW_POST/ARWpost$ ./configure
Will use NETCDF in dir: /home/ranjith/Desktop/WRF/Build_WRF/LIBRARIES/netcdf-4.1.3
------------------------------------------------------------------------
Please select from among the following supported platforms.

1. PC Linux i486 i586 i686 x86_64, PGI compiler
2. PC Linux i486 i586 i686 x86_64, Intel compiler
3. PC Linux i486 i586 i686 x86_64, gfortran compiler

Enter selection [1-3] : 3
------------------------------------------------------------------------
Configuration successful. To build the ARWpost, type: compile
------------------------------------------------------------------------
ranjith@ranjithoffice:~/Desktop/WRF/ARW_POST/ARWpost$ ./compile

**** Compiling ARWpost ****

/bin/rm -f module_model_basics.o module_model_basics.mod
/bin/cp module_model_basics.f90 module_model_basics.f
gfortran -ffree-form -O -fno-second-underscore -fconvert=big-endian -frecord-marker=4 -I/home/ranjith/Desktop/WRF/Build_WRF/LIBRARIES/netcdf-4.1.3/include -c module_model_basics.f
/bin/rm -f module_model_basics.f
/bin/rm -f constants_module.o constants_module.mod
/bin/cp constants_module.f90 constants_module.f
gfortran -ffree-form -O -fno-second-underscore -fconvert=big-endian -frecord-marker=4 -I/home/ranjith/Desktop/WRF/Build_WRF/LIBRARIES/netcdf-4.1.3/include -c constants_module.f
/bin/rm -f constants_module.f
/bin/rm -f misc_definitions_module.o misc_definitions_module.mod
/bin/cp misc_definitions_module.f90 misc_definitions_module.f
gfortran -ffree-form -O -fno-second-underscore -fconvert=big-endian -frecord-marker=4 -I/home/ranjith/Desktop/WRF/Build_WRF/LIBRARIES/netcdf-4.1.3/include -c misc_definitions_module.f
/bin/rm -f misc_definitions_module.f
/bin/rm -f module_debug.o module_debug.mod
/bin/cp module_debug.f90 module_debug.f
gfortran -ffree-form -O -fno-second-underscore -fconvert=big-endian -frecord-marker=4 -I/home/ranjith/Desktop/WRF/Build_WRF/LIBRARIES/netcdf-4.1.3/include -c module_debug.f
/bin/rm -f module_debug.f
/bin/rm -f module_get_file_names.o module_get_file_names.mod
/lib/cpp -C -P -traditional -DIO_NETCDF -DIO_GRIB1 -DIO_BINARY -DRECL4 -Dbytesw module_get_file_names.F90 > module_get_file_names.f
gfortran -ffree-form -O -fno-second-underscore -fconvert=big-endian -frecord-marker=4 -I/home/ranjith/Desktop/WRF/Build_WRF/LIBRARIES/netcdf-4.1.3/include -c module_get_file_names.f
/bin/rm -f module_get_file_names.f
/bin/rm -f gridinfo_module.o gridinfo_module.mod
/bin/cp gridinfo_module.f90 gridinfo_module.f
gfortran -ffree-form -O -fno-second-underscore -fconvert=big-endian -frecord-marker=4 -I/home/ranjith/Desktop/WRF/Build_WRF/LIBRARIES/netcdf-4.1.3/include -c gridinfo_module.f
gridinfo_module.f:14: Error: Can't open included file 'netcdf.inc'
make: [gridinfo_module.o] Error 1 (ignored)
/bin/rm -f gridinfo_module.f
/bin/rm -f module_date_pack.o module_date_pack.mod
/bin/cp module_date_pack.f90 module_date_pack.f
gfortran -ffree-form -O -fno-second-underscore -fconvert=big-endian -frecord-marker=4 -I/home/ranjith/Desktop/WRF/Build_WRF/LIBRARIES/netcdf-4.1.3/include -c module_date_pack.f
/bin/rm -f module_date_pack.f
/bin/rm -f input_module.o input_module.mod
/bin/cp input_module.f90 input_module.f
gfortran -ffree-form -O -fno-second-underscore -fconvert=big-endian -frecord-marker=4 -I/home/ranjith/Desktop/WRF/Build_WRF/LIBRARIES/netcdf-4.1.3/include -c input_module.f
input_module.f:3.22:

USE gridinfo_module
1
Fatal Error: Can't open module file 'gridinfo_module.mod' for reading at (1): No such file or directory
make: [input_module.o] Error 1 (ignored)
/bin/rm -f input_module.f
/bin/rm -f module_arrays.o module_arrays.mod
/bin/cp module_arrays.f90 module_arrays.f
gfortran -ffree-form -O -fno-second-underscore -fconvert=big-endian -frecord-marker=4 -I/home/ranjith/Desktop/WRF/Build_WRF/LIBRARIES/netcdf-4.1.3/include -c module_arrays.f
module_arrays.f:75.21:

USE gridinfo_module
1
Fatal Error: Can't open module file 'gridinfo_module.mod' for reading at (1): No such file or directory
make: [module_arrays.o] Error 1 (ignored)
/bin/rm -f module_arrays.f
/bin/rm -f module_pressure.o module_pressure.mod
/bin/cp module_pressure.f90 module_pressure.f
gfortran -ffree-form -O -fno-second-underscore -fconvert=big-endian -frecord-marker=4 -I/home/ranjith/Desktop/WRF/Build_WRF/LIBRARIES/netcdf-4.1.3/include -c module_pressure.f
/bin/rm -f module_pressure.f
/bin/rm -f module_interp.o module_interp.mod
/bin/cp module_interp.f90 module_interp.f
gfortran -ffree-form -O -fno-second-underscore -fconvert=big-endian -frecord-marker=4 -I/home/ranjith/Desktop/WRF/Build_WRF/LIBRARIES/netcdf-4.1.3/include -c module_interp.f
module_interp.f:3.19:

USE input_module
1
Fatal Error: Can't open module file 'input_module.mod' for reading at (1): No such file or directory
make: [module_interp.o] Error 1 (ignored)
/bin/rm -f module_interp.f
/bin/rm -f output_module.o output_module.mod
/lib/cpp -C -P -traditional -DIO_NETCDF -DIO_GRIB1 -DIO_BINARY -DRECL4 -Dbytesw output_module.F90 > output_module.f
gfortran -ffree-form -O -fno-second-underscore -fconvert=big-endian -frecord-marker=4 -I/home/ranjith/Desktop/WRF/Build_WRF/LIBRARIES/netcdf-4.1.3/include -c output_module.f
output_module.f:3.19:

USE input_module
1
Fatal Error: Can't open module file 'input_module.mod' for reading at (1): No such file or directory
make: [output_module.o] Error 1 (ignored)
/bin/rm -f output_module.f
/bin/rm -f module_basic_arrays.o module_basic_arrays.mod
/bin/cp module_basic_arrays.f90 module_basic_arrays.f
gfortran -ffree-form -O -fno-second-underscore -fconvert=big-endian -frecord-marker=4 -I/home/ranjith/Desktop/WRF/Build_WRF/LIBRARIES/netcdf-4.1.3/include -c module_basic_arrays.f
module_basic_arrays.f:3.21:

USE gridinfo_module
1
Fatal Error: Can't open module file 'gridinfo_module.mod' for reading at (1): No such file or directory
make: [module_basic_arrays.o] Error 1 (ignored)
/bin/rm -f module_basic_arrays.f
/bin/rm -f module_calc_height.o module_calc_height.mod
/bin/cp module_calc_height.f90 module_calc_height.f
gfortran -ffree-form -O -fno-second-underscore -fconvert=big-endian -frecord-marker=4 -I/home/ranjith/Desktop/WRF/Build_WRF/LIBRARIES/netcdf-4.1.3/include -c module_calc_height.f
/bin/rm -f module_calc_height.f
/bin/rm -f module_calc_pressure.o module_calc_pressure.mod
/bin/cp module_calc_pressure.f90 module_calc_pressure.f
gfortran -ffree-form -O -fno-second-underscore -fconvert=big-endian -frecord-marker=4 -I/home/ranjith/Desktop/WRF/Build_WRF/LIBRARIES/netcdf-4.1.3/include -c module_calc_pressure.f
/bin/rm -f module_calc_pressure.f
/bin/rm -f module_calc_tk.o module_calc_tk.mod
/bin/cp module_calc_tk.f90 module_calc_tk.f
gfortran -ffree-form -O -fno-second-underscore -fconvert=big-endian -frecord-marker=4 -I/home/ranjith/Desktop/WRF/Build_WRF/LIBRARIES/netcdf-4.1.3/include -c module_calc_tk.f
/bin/rm -f module_calc_tk.f
/bin/rm -f module_calc_tc.o module_calc_tc.mod
/bin/cp module_calc_tc.f90 module_calc_tc.f
gfortran -ffree-form -O -fno-second-underscore -fconvert=big-endian -frecord-marker=4 -I/home/ranjith/Desktop/WRF/Build_WRF/LIBRARIES/netcdf-4.1.3/include -c module_calc_tc.f
/bin/rm -f module_calc_tc.f
/bin/rm -f module_calc_theta.o module_calc_theta.mod
/bin/cp module_calc_theta.f90 module_calc_theta.f
gfortran -ffree-form -O -fno-second-underscore -fconvert=big-endian -frecord-marker=4 -I/home/ranjith/Desktop/WRF/Build_WRF/LIBRARIES/netcdf-4.1.3/include -c module_calc_theta.f
/bin/rm -f module_calc_theta.f
/bin/rm -f module_calc_td.o module_calc_td.mod
/bin/cp module_calc_td.f90 module_calc_td.f
gfortran -ffree-form -O -fno-second-underscore -fconvert=big-endian -frecord-marker=4 -I/home/ranjith/Desktop/WRF/Build_WRF/LIBRARIES/netcdf-4.1.3/include -c module_calc_td.f
/bin/rm -f module_calc_td.f
/bin/rm -f module_calc_td2.o module_calc_td2.mod
/bin/cp module_calc_td2.f90 module_calc_td2.f
gfortran -ffree-form -O -fno-second-underscore -fconvert=big-endian -frecord-marker=4 -I/home/ranjith/Desktop/WRF/Build_WRF/LIBRARIES/netcdf-4.1.3/include -c module_calc_td2.f
/bin/rm -f module_calc_td2.f
/bin/rm -f module_calc_rh.o module_calc_rh.mod
/bin/cp module_calc_rh.f90 module_calc_rh.f
gfortran -ffree-form -O -fno-second-underscore -fconvert=big-endian -frecord-marker=4 -I/home/ranjith/Desktop/WRF/Build_WRF/LIBRARIES/netcdf-4.1.3/include -c module_calc_rh.f
/bin/rm -f module_calc_rh.f
/bin/rm -f module_calc_rh2.o module_calc_rh2.mod
/bin/cp module_calc_rh2.f90 module_calc_rh2.f
gfortran -ffree-form -O -fno-second-underscore -fconvert=big-endian -frecord-marker=4 -I/home/ranjith/Desktop/WRF/Build_WRF/LIBRARIES/netcdf-4.1.3/include -c module_calc_rh2.f
/bin/rm -f module_calc_rh2.f
/bin/rm -f module_calc_uvmet.o module_calc_uvmet.mod
/bin/cp module_calc_uvmet.f90 module_calc_uvmet.f
gfortran -ffree-form -O -fno-second-underscore -fconvert=big-endian -frecord-marker=4 -I/home/ranjith/Desktop/WRF/Build_WRF/LIBRARIES/netcdf-4.1.3/include -c module_calc_uvmet.f
/bin/rm -f module_calc_uvmet.f
/bin/rm -f module_calc_slp.o module_calc_slp.mod
/bin/cp module_calc_slp.f90 module_calc_slp.f
gfortran -ffree-form -O -fno-second-underscore -fconvert=big-endian -frecord-marker=4 -I/home/ranjith/Desktop/WRF/Build_WRF/LIBRARIES/netcdf-4.1.3/include -c module_calc_slp.f
/bin/rm -f module_calc_slp.f
/bin/rm -f module_calc_dbz.o module_calc_dbz.mod
/bin/cp module_calc_dbz.f90 module_calc_dbz.f
gfortran -ffree-form -O -fno-second-underscore -fconvert=big-endian -frecord-marker=4 -I/home/ranjith/Desktop/WRF/Build_WRF/LIBRARIES/netcdf-4.1.3/include -c module_calc_dbz.f
/bin/rm -f module_calc_dbz.f
/bin/rm -f module_calc_cape.o module_calc_cape.mod
/bin/cp module_calc_cape.f90 module_calc_cape.f
gfortran -ffree-form -O -fno-second-underscore -fconvert=big-endian -frecord-marker=4 -I/home/ranjith/Desktop/WRF/Build_WRF/LIBRARIES/netcdf-4.1.3/include -c module_calc_cape.f
/bin/rm -f module_calc_cape.f
/bin/rm -f module_calc_wdir.o module_calc_wdir.mod
/bin/cp module_calc_wdir.f90 module_calc_wdir.f
gfortran -ffree-form -O -fno-second-underscore -fconvert=big-endian -frecord-marker=4 -I/home/ranjith/Desktop/WRF/Build_WRF/LIBRARIES/netcdf-4.1.3/include -c module_calc_wdir.f
/bin/rm -f module_calc_wdir.f
/bin/rm -f module_calc_wspd.o module_calc_wspd.mod
/bin/cp module_calc_wspd.f90 module_calc_wspd.f
gfortran -ffree-form -O -fno-second-underscore -fconvert=big-endian -frecord-marker=4 -I/home/ranjith/Desktop/WRF/Build_WRF/LIBRARIES/netcdf-4.1.3/include -c module_calc_wspd.f
/bin/rm -f module_calc_wspd.f
/bin/rm -f module_calc_clfr.o module_calc_clfr.mod
/bin/cp module_calc_clfr.f90 module_calc_clfr.f
gfortran -ffree-form -O -fno-second-underscore -fconvert=big-endian -frecord-marker=4 -I/home/ranjith/Desktop/WRF/Build_WRF/LIBRARIES/netcdf-4.1.3/include -c module_calc_clfr.f
/bin/rm -f module_calc_clfr.f
/bin/rm -f module_diagnostics.o module_diagnostics.mod
/bin/cp module_diagnostics.f90 module_diagnostics.f
gfortran -ffree-form -O -fno-second-underscore -fconvert=big-endian -frecord-marker=4 -I/home/ranjith/Desktop/WRF/Build_WRF/LIBRARIES/netcdf-4.1.3/include -c module_diagnostics.f
module_diagnostics.f:6.19:

USE output_module
1
Fatal Error: Can't open module file 'output_module.mod' for reading at (1): No such file or directory
make: [module_diagnostics.o] Error 1 (ignored)
/bin/rm -f module_diagnostics.f
/bin/rm -f process_domain_module.o process_domain_module.mod
/lib/cpp -C -P -traditional -DIO_NETCDF -DIO_GRIB1 -DIO_BINARY -DRECL4 -Dbytesw process_domain_module.F90 > process_domain_module.f
gfortran -ffree-form -O -fno-second-underscore -fconvert=big-endian -frecord-marker=4 -I/home/ranjith/Desktop/WRF/Build_WRF/LIBRARIES/netcdf-4.1.3/include -c process_domain_module.f
process_domain_module.f:3.19:

USE input_module
1
Fatal Error: Can't open module file 'input_module.mod' for reading at (1): No such file or directory
make: [process_domain_module.o] Error 1 (ignored)
/bin/rm -f process_domain_module.f
/bin/rm -f ARWpost.o ARWpost.mod
/bin/cp ARWpost.f90 ARWpost.f
gfortran -ffree-form -O -fno-second-underscore -fconvert=big-endian -frecord-marker=4 -I/home/ranjith/Desktop/WRF/Build_WRF/LIBRARIES/netcdf-4.1.3/include -c ARWpost.f
ARWpost.f:9.22:

USE gridinfo_module
1
Fatal Error: Can't open module file 'gridinfo_module.mod' for reading at (1): No such file or directory
make: [ARWpost.o] Error 1 (ignored)
/bin/rm -f ARWpost.f
/bin/rm -f module_map_utils.o module_map_utils.mod
/bin/cp module_map_utils.f90 module_map_utils.f
gfortran -ffree-form -O -fno-second-underscore -fconvert=big-endian -frecord-marker=4 -I/home/ranjith/Desktop/WRF/Build_WRF/LIBRARIES/netcdf-4.1.3/include -c module_map_utils.f
/bin/rm -f module_map_utils.f
gfortran -ffree-form -O -fno-second-underscore -fconvert=big-endian -frecord-marker=4 -o ARWpost.exe module_model_basics.o constants_module.o gridinfo_module.o ARWpost.o input_module.o output_module.o module_map_utils.o misc_definitions_module.o module_date_pack.o module_debug.o process_domain_module.o module_get_file_names.o module_interp.o module_basic_arrays.o module_diagnostics.o module_arrays.o module_pressure.o module_calc_height.o module_calc_pressure.o module_calc_theta.o module_calc_tk.o module_calc_tc.o module_calc_td.o module_calc_td2.o module_calc_rh.o module_calc_rh2.o module_calc_uvmet.o module_calc_slp.o module_calc_dbz.o module_calc_cape.o module_calc_wdir.o module_calc_wspd.o module_calc_clfr.o \
-L/home/ranjith/Desktop/WRF/Build_WRF/LIBRARIES/netcdf-4.1.3/lib -I/home/ranjith/Desktop/WRF/Build_WRF/LIBRARIES/netcdf-4.1.3/include -lnetcdf
gfortran: gridinfo_module.o: No such file or directory
gfortran: ARWpost.o: No such file or directory
gfortran: input_module.o: No such file or directory
gfortran: output_module.o: No such file or directory
gfortran: process_domain_module.o: No such file or directory
gfortran: module_interp.o: No such file or directory
gfortran: module_basic_arrays.o: No such file or directory
gfortran: module_diagnostics.o: No such file or directory
gfortran: module_arrays.o: No such file or directory
make: [ARWpost.exe] Error 1 (ignored)
Jipson Johnson
 
Posts: 24
Joined: Thu Jan 08, 2015 2:15 pm


Return to ARWPost

Who is online

Users browsing this forum: No registered users and 2 guests

cron